Benzenemethanamine, N,N,4-trimethyl-
- Formula: C10H15N
- Molecular weight: 149.2328
- IUPAC Standard InChIKey: JAOPKYRWYXCGOQ-UHFFFAOYSA-N
- CAS Registry Number: 4052-88-4
- Chemical structure:
View 3d structure (requires JavaScript / HTML 5) - Other names: Benzylamine, N,N,p-trimethyl-; p-Methylbenzyldimethylamine; N,N,p-Trimethylbenzylamine; 4-N,N-Trimethylbenzylamine; p-methyl N,N dimethyl benzylamine

Gas phase ion energetics data

Data compiled as indicated in comments:
LLK - Sharon G. Lias, Rhoda D. Levin, and Sherif A. Kafafi
Ionization energy determinations
IE (eV) | Method | Reference | Comment |
---|---|---|---|
7.61 ± 0.03 | PI | Loguinov, Takhistov, et al., 1981 | LLK |
Appearance energy determinations
Ion | AE (eV) | Other Products | Method | Reference | Comment |
---|---|---|---|---|---|
C3H8N+ | 9.60 ± 0.05 | C6H4CH3 | PI | Loguinov, Takhistov, et al., 1981 | LLK |

References

Loguinov, Takhistov, et al., 1981
Loguinov, Y.; Takhistov, V.V.; Vatlina, L.P.,
Photoionization studies of substituted trimethylamines,
Org. Mass Spectrom., 1981, 16, 239. [all data]