1,2,3-Metheno-1H-phenalene,2,3-dihydro
- Formula: C14H10
- Molecular weight: 178.2292
- IUPAC Standard InChIKey: MXBNGWSWTJKGCF-UHFFFAOYSA-N
- CAS Registry Number: 40480-63-5
- Chemical structure:
View 3d structure (requires JavaScript / HTML 5) - Permanent link for this species. Use this link for bookmarking this species for future reference.

Gas phase ion energetics data

Data compiled as indicated in comments:
LLK - Sharon G. Lias, Rhoda D. Levin, and Sherif A. Kafafi
Ionization energy determinations
IE (eV) | Method | Reference | Comment |
---|---|---|---|
7.55 | PE | Gleiter, Gubernator, et al., 1981 | LLK |
7.55 | PE | Gleiter, Haider, et al., 1979 | Vertical value; LLK |

References

Gleiter, Gubernator, et al., 1981
Gleiter, R.; Gubernator, K.; Eckert-Maksic, M.; Spanget-Larsen, J.; Bianco, B.; Gandillon, G.; Berger, U.,
120. The electronic structure of phenylene and naphthylene bicyclobutanes. Photoelectron spectroscopy and model calculations,
Helv. Chim. Acta, 1981, 64, 1312. [all data]
Gleiter, Haider, et al., 1979
Gleiter, R.; Haider, R.; Murata, I.; Pagni, R.M.,
Photoelectron spectra of three isomeric (C14H10) naphtho[1,8]-fused hydrocarbons,
J. Chem. Res. Synop., 1979, 72. [all data]