1,3-Cyclopentadiene, 1,2,3,4,5-pentamethyl-
- Formula: C10H16
- Molecular weight: 136.2340
- IUPAC Standard InChIKey: WQIQNKQYEUMPBM-UHFFFAOYSA-N
- CAS Registry Number: 4045-44-7
- Chemical structure:
View 3d structure (requires JavaScript / HTML 5) - Other names: Cyclopentadiene, 1,2,3,4,5-pentamethyl-; 1,2,3,4,5-Pentamethylcyclopentadiene; 1,2,3,4,5-Pentamethyl-1,3-cyclopentadiene; Pentamethylcyclopentadiene

Gas phase thermochemistry data

Data compiled by: Hussein Y. Afeefy, Joel F. Liebman, and Stephen E. Stein
Quantity | Value | Units | Method | Reference | Comment |
---|---|---|---|---|---|
ΔfH°gas | -25. | kJ/mol | Chyd | Roth, Adamczak, et al., 1991 |

Phase change data

Data compiled by: Robert L. Brown and Stephen E. Stein
Reduced pressure boiling point
Tboil (K) | Pressure (bar) | Reference |
---|---|---|
331.2 | 0.017 | Aldrich Chemical Company Inc., 1990 |

Reaction thermochemistry data

Data compiled as indicated in comments:
B - John E. Bartmess
ALS - Hussein Y. Afeefy, Joel F. Liebman, and Stephen E. Stein
Individual Reactions
C10H15- + =
By formula: C10H15- + H+ = C10H16
Quantity | Value | Units | Method | Reference | Comment |
---|---|---|---|---|---|
ΔrH° | 1510. ± 9.2 | kJ/mol | G+TS | Taft, 1987 | gas phase; value altered from reference due to change in acidity scale; B |
Quantity | Value | Units | Method | Reference | Comment |
ΔrG° | 1485. ± 8.4 | kJ/mol | IMRE | Taft, 1987 | gas phase; value altered from reference due to change in acidity scale; B |
By formula: 2H2 + C10H16 = C10H20
Quantity | Value | Units | Method | Reference | Comment |
---|---|---|---|---|---|
ΔrH° | -188. ± 0.8 | kJ/mol | Chyd | Roth, Adamczak, et al., 1991 | liquid phase; ALS |

Gas phase ion energetics data

Data compiled as indicated in comments:
B - John E. Bartmess
LL - Sharon G. Lias and Joel F. Liebman
Ionization energy determinations
IE (eV) | Method | Reference | Comment |
---|---|---|---|
7.17 | PE | Kiselev, Sakhabutdinov, et al., 1992 | LL |
7.35 | PE | Kiselev, Sakhabutdinov, et al., 1992 | Vertical value; LL |
De-protonation reactions
C10H15- + =
By formula: C10H15- + H+ = C10H16
Quantity | Value | Units | Method | Reference | Comment |
---|---|---|---|---|---|
ΔrH° | 1510. ± 9.2 | kJ/mol | G+TS | Taft, 1987 | gas phase; value altered from reference due to change in acidity scale; B |
Quantity | Value | Units | Method | Reference | Comment |
ΔrG° | 1485. ± 8.4 | kJ/mol | IMRE | Taft, 1987 | gas phase; value altered from reference due to change in acidity scale; B |

References

Roth, Adamczak, et al., 1991
Roth, W.R.; Adamczak, O.; Breuckmann, R.; Lennartz, H.-W.; Boese, R.,
Die Berechnung von Resonanzenergien; das MM2ERW-Kraftfeld,
Chem. Ber., 1991, 124, 2499-2521. [all data]
Aldrich Chemical Company Inc., 1990
Aldrich Chemical Company Inc.,
Catalog Handbook of Fine Chemicals, Aldrich Chemical Company, Inc., Milwaukee WI, 1990, 1. [all data]
Taft, 1987
Taft, R.W.,
The Nature and Analysis of Substitutent Electronic Effects,
Personal communication. See also Prog. Phys. Org. Chem., 1987, 16, 1. [all data]
Kiselev, Sakhabutdinov, et al., 1992
Kiselev, V.D.; Sakhabutdinov, A.G.; Shakirov, I.M.; Zverev, V.V.; Konovalov, A.I.,
Bis reactants in Diels-Alder reactions. VII. Preparation and properties of polyadducts of reactions of bis(polymethylcyclopentadienes) and bis(maleimides),
Zh. Org. Khim., 1992, 28, 2244. [all data]