1,2,4,3,5-Triazadiborolidine,1,2,4-trimethyl-3,5-bis(methylthio)-
- Formula: C5H15B2N3S2
- Molecular weight: 202.945
- IUPAC Standard InChIKey: CLZWPTZVLWWIQR-UHFFFAOYSA-N
- CAS Registry Number: 40392-36-7
- Chemical structure:
View 3d structure (requires JavaScript / HTML 5) - Permanent link for this species. Use this link for bookmarking this species for future reference.

Gas phase ion energetics data

Data compiled by: Sharon G. Lias, Rhoda D. Levin, and Sherif A. Kafafi
Ionization energy determinations
IE (eV) | Method | Reference | Comment |
---|---|---|---|
7.74 | PE | Kroner, Nolle, et al., 1975 | Vertical value |

References

Kroner, Nolle, et al., 1975
Kroner, J.; Nolle, D.; Noth, H.; Winterstein, W.,
Photoelektronenspektroskopische untersuchungen an bor-verbindungen, II funfgliedrige hetero - cyclen des bors,
Chem. Ber., 1975, 108, 3807. [all data]