Benzonitrile, 3-fluoro-
- Formula: C7H4FN
- Molecular weight: 121.1118
- IUPAC Standard InChIKey: JZTPKAROPNTQQV-UHFFFAOYSA-N
- CAS Registry Number: 403-54-3
- Chemical structure:
View 3d structure (requires JavaScript / HTML 5) - Other names: Benzonitrile, m-fluoro-; m-Cyanofluorobenzene; m-Fluorobenzonitrile; 3-Fluorobenzonitrile

Phase change data

Data compiled by: Robert L. Brown and Stephen E. Stein
Quantity | Value | Units | Method | Reference | Comment |
---|---|---|---|---|---|
Tboil | 455. to 456. | K | N/A | PCR Inc., 1990 |
Reduced pressure boiling point
Tboil (K) | Pressure (bar) | Reference |
---|---|---|
455.7 | 1.00 | Aldrich Chemical Company Inc., 1990 |

Gas phase ion energetics data

Data compiled as indicated in comments:
LLK - Sharon G. Lias, Rhoda D. Levin, and Sherif A. Kafafi
RDSH - Henry M. Rosenstock, Keith Draxl, Bruce W. Steiner, and John T. Herron
Ionization energy determinations
IE (eV) | Method | Reference | Comment |
---|---|---|---|
9.79 | PE | Palmer, Moyes, et al., 1980 | LLK |
10.03 ± 0.05 | EI | Buchs, 1970 | RDSH |
9.79 | PE | Palmer, Moyes, et al., 1980 | Vertical value; LLK |

References

PCR Inc., 1990
PCR Inc.,
Research Chemicals Catalog 1990-1991, PCR Inc., Gainesville, FL, 1990, 1. [all data]
Aldrich Chemical Company Inc., 1990
Aldrich Chemical Company Inc.,
Catalog Handbook of Fine Chemicals, Aldrich Chemical Company, Inc., Milwaukee WI, 1990, 1. [all data]
Palmer, Moyes, et al., 1980
Palmer, M.H.; Moyes, W.; Spiers, M.,
The electronic structure of substituted benzenes: Ab initio calculations and photoelectron spectra for benzonitrile, the tolunitriles, fluorobenzonitriles, dicyanobenzenes and ethynylbenzene,
J. Mol. Struct., 1980, 62, 165. [all data]
Buchs, 1970
Buchs, A.,
Etude par spectrometrie de masse de l'ionisation de benzonitriles, de phenylacetonitriles et de N,N-dimethylanilines substitues,
Helv. Chim. Acta, 1970, 53, 2026. [all data]