Benzenamine,2,5-dichloro-3,6-dimethyl-4-nitro-
- Formula: C8H8Cl2N2O2
- Molecular weight: 235.067
- IUPAC Standard InChIKey: ZXPROJDGHWYZAK-UHFFFAOYSA-N
- CAS Registry Number: 40331-38-2
- Chemical structure:
View 3d structure (requires JavaScript / HTML 5) - Permanent link for this species. Use this link for bookmarking this species for future reference.

Gas phase ion energetics data

Data compiled by: Sharon G. Lias, Rhoda D. Levin, and Sherif A. Kafafi
Ionization energy determinations
IE (eV) | Method | Reference |
---|---|---|
8.17 ± 0.03 | PI | Potapov, Kardash, et al., 1972 |

References

Potapov, Kardash, et al., 1972
Potapov, V.K.; Kardash, I.E.; Sorokin, V.V.; Sokolov, S.A.; Evlasheva, T.I.,
Photoionization of heteroaromatic compounds,
Khim. Vys. Energ., 1972, 6, 392. [all data]