2-Penten-4-yn-1-ol,5-phenyl-,(E)-
- Formula: C11H10O
- Molecular weight: 158.1965
- IUPAC Standard InChIKey: JSNIMQCVEHRHSB-QHHAFSJGSA-N
- CAS Registry Number: 40317-08-6
- Chemical structure:
View 3d structure (requires JavaScript / HTML 5) - Permanent link for this species. Use this link for bookmarking this species for future reference.

Gas phase ion energetics data

Data compiled by: Sharon G. Lias, Rhoda D. Levin, and Sherif A. Kafafi
Appearance energy determinations
Ion | AE (eV) | Other Products | Method | Reference | Comment |
---|---|---|---|---|---|
C9H7+ | 11.43 ± 0.05 | ? | EI | Schwarz and Bohlmann, 1973 |

References

Schwarz and Bohlmann, 1973
Schwarz, H.; Bohlmann, F.,
Elektronenstossinduzierte fragmentierung von acetylenverbindungen. VI. Struktur und bildungsenthalpie der ionen [C11H9]+ und [C9H7]+,
Org. Mass Spectrom., 1973, 7, 395. [all data]