Benzene, 1-ethyl-4-ethynyl-
- Formula: C10H10
- Molecular weight: 130.1864
- IUPAC Standard InChIKey: ZNTJVJSUNSUMPP-UHFFFAOYSA-N
- CAS Registry Number: 40307-11-7
- Chemical structure:
View 3d structure (requires JavaScript / HTML 5) - Species with the same structure:
- Other names: 4-ethylphenyl acetylene

Gas phase ion energetics data

Data compiled by: Sharon G. Lias, John E. Bartmess, Joel F. Liebman, John L. Holmes, Rhoda D. Levin, and W. Gary Mallard
Ionization energy determinations
IE (eV) | Method | Reference |
---|---|---|
8.42 | PI | Domnin, Lakshin, et al., 1985 |
Appearance energy determinations
Ion | AE (eV) | Other Products | Method | Reference | Comment |
---|---|---|---|---|---|
C9H7+ | 9.53 | CH3 | PI | Domnin, Lakshin, et al., 1985 |

References

Domnin, Lakshin, et al., 1985
Domnin, I.N.; Lakshin, A.M.; Misharev, A.D.; Orlov, V.M.; Takhistov, V.V.,
Thermochemical investigation of some hydrocarbon ions generated by photoionization,
J. Org. Chem. USSR, 1985, 21, 1149. [all data]