2,4-Cyclohexadien-1-one,6-diazo-
- Formula: C6H4N2O
- Molecular weight: 120.1088
- IUPAC Standard InChIKey: RXTHAGCVCGSZLO-UHFFFAOYSA-N
- CAS Registry Number: 4024-72-0
- Chemical structure:
View 3d structure (requires JavaScript / HTML 5) - Permanent link for this species. Use this link for bookmarking this species for future reference.

Gas phase ion energetics data

Data compiled by: Sharon G. Lias, Rhoda D. Levin, and Sherif A. Kafafi
Appearance energy determinations
Ion | AE (eV) | Other Products | Method | Reference | Comment |
---|---|---|---|---|---|
C6H4N2O+ | 9.5 ± 0.01 | N2 | EI | Thorstad, Undheim, et al., 1974 | |
C6H4O+ | 8.29 ± 0.05 | N2 | EI | Thorstad, Undheim, et al., 1974 |

References

Thorstad, Undheim, et al., 1974
Thorstad, O.; Undheim, K.; Hvistendahl, G.,
Mass spectrometry of onium compounds. XXIII. Ionisation potentials in the structural assignment of [M-N2]ions from diazo-oxides,
Org. Mass Spectrom., 1974, 9, 548. [all data]