Benzene, 1-fluoro-4-(trifluoromethyl)-
- Formula: C7H4F4
- Molecular weight: 164.1003
- IUPAC Standard InChIKey: UNNNAIWPDLRVRN-UHFFFAOYSA-N
- CAS Registry Number: 402-44-8
- Chemical structure:
View 3d structure (requires JavaScript / HTML 5) - Other names: p-Fluorobenzotrifluoride; p,α,α,α-Tetrafluorotoluene; 4-Fluorobenzotrifluoride; α,α,α,p-Tetrafluorotoluene; p-(Trifluoromethyl)fluorobenzene; p-Fluorotrifluoromethylbenzene; Toluene, p,α,α,α-tetrafluoro-; 1-Fluoro-4-(trifluoromethyl)benzene; NSC 88289; α,α,α,4-tetrafluorotoluene

Phase change data

Data compiled as indicated in comments:
BS - Robert L. Brown and Stephen E. Stein
AC - William E. Acree, Jr., James S. Chickos
Quantity | Value | Units | Method | Reference | Comment |
---|---|---|---|---|---|
Tboil | 375.9 | K | N/A | PCR Inc., 1990 | BS |
Tboil | 376.7 | K | N/A | Weast and Grasselli, 1989 | BS |
Enthalpy of vaporization
ΔvapH (kJ/mol) | Temperature (K) | Method | Reference | Comment |
---|---|---|---|---|
35.8 | 301. | A | Stephenson and Malanowski, 1987 | Based on data from 286. to 381. K. See also Dykyj and Vanko, 1970.; AC |

Gas phase ion energetics data

Data compiled by: Sharon G. Lias, John E. Bartmess, Joel F. Liebman, John L. Holmes, Rhoda D. Levin, and W. Gary Mallard
Ionization energy determinations
IE (eV) | Method | Reference | Comment |
---|---|---|---|
9.98 | PE | Cabelli, Cowley, et al., 1982 | Vertical value |

References

PCR Inc., 1990
PCR Inc.,
Research Chemicals Catalog 1990-1991, PCR Inc., Gainesville, FL, 1990, 1. [all data]
Weast and Grasselli, 1989
CRC Handbook of Data on Organic Compounds, 2nd Editon, Weast,R.C and Grasselli, J.G., ed(s)., CRC Press, Inc., Boca Raton, FL, 1989, 1. [all data]
Stephenson and Malanowski, 1987
Stephenson, Richard M.; Malanowski, Stanislaw,
Handbook of the Thermodynamics of Organic Compounds, 1987, https://doi.org/10.1007/978-94-009-3173-2
. [all data]
Dykyj and Vanko, 1970
Dykyj, J.; Vanko, A.,
Petrochemica, 1970, 10, 1, 3. [all data]
Cabelli, Cowley, et al., 1982
Cabelli, D.E.; Cowley, A.H.; Lagowski, J.J.,
The bonding in some bis(arene)chromium compounds as indicated by U. V. photoelectron zpectroscopy,
Inorg. Chim. Acta, 1982, 57, 195. [all data]