Benzene, 1-bromo-4-(trifluoromethyl)-
- Formula: C7H4BrF3
- Molecular weight: 225.006
- IUPAC Standard InChIKey: XLQSXGGDTHANLN-UHFFFAOYSA-N
- CAS Registry Number: 402-43-7
- Chemical structure:
View 3d structure (requires JavaScript / HTML 5) - Other names: Toluene, p-bromo-α,α,α-trifluoro-; p-(Trifluoromethyl)bromobenzene; p-Bromo-α,α,α-trifluorotoluene; p-Bromobenzotrifluoride; para-Bromobenzotrifluoride; 1-Bromo-4-(trifluoromethyl)benzene; 4-Bromobenzotrifluoride; 4-Trifluoromethylbromobenzene; 4-Bromo-α,α,α-trifluorotoluene

Phase change data

Data compiled by: Robert L. Brown and Stephen E. Stein
Quantity | Value | Units | Method | Reference | Comment |
---|---|---|---|---|---|
Tboil | 427. to 428. | K | N/A | Farchan Laboratories, 1990 | |
Tboil | 427. to 428. | K | N/A | PCR Inc., 1990 | |
Tboil | 427.7 | K | N/A | Weast and Grasselli, 1989 |

Gas phase ion energetics data

Data compiled as indicated in comments:
LLK - Sharon G. Lias, Rhoda D. Levin, and Sherif A. Kafafi
RDSH - Henry M. Rosenstock, Keith Draxl, Bruce W. Steiner, and John T. Herron
Ionization energy determinations
IE (eV) | Method | Reference | Comment |
---|---|---|---|
9.48 | PE | Gounelle, Jullien, et al., 1975 | Vertical value; LLK |
9.55 | PE | Baker, May, et al., 1968 | Vertical value; RDSH |

Van Den Dool and Kratz RI, non-polar column, temperature ramp

Column type | Active phase | I | Reference | Comment |
---|---|---|---|---|
Capillary | OV-1 | 916.1 | Gautzsch and Zinn, 1996 | 8. K/min; Tstart: 35. C; Tend: 300. C |
Capillary | OV-1 | 916.1 | Gautzsch and Zinn, 1996 | 8. K/min; Tstart: 35. C; Tend: 300. C |

References

Farchan Laboratories, 1990
Farchan Laboratories,
Research Chemicals Catalog, Farchan Laboratories, Gainesville, FL, 1990, 91. [all data]
PCR Inc., 1990
PCR Inc.,
Research Chemicals Catalog 1990-1991, PCR Inc., Gainesville, FL, 1990, 1. [all data]
Weast and Grasselli, 1989
CRC Handbook of Data on Organic Compounds, 2nd Editon, Weast,R.C and Grasselli, J.G., ed(s)., CRC Press, Inc., Boca Raton, FL, 1989, 1. [all data]
Gounelle, Jullien, et al., 1975
Gounelle, Y.; Jullien, J.; Solgadi, D.; Botter, R.; Menes, F.,
No. 157. - Effets de l'isomerie sur les potentiels d'ionisation: Spectres des photoelectrons de dihalogeno-benzenes,
J. Chim. Phys., 1975, 10, 1094. [all data]
Baker, May, et al., 1968
Baker, A.D.; May, D.P.; Turner, D.W.,
Molecular photoelectron spectroscopy. Part VII. The vertical ionisation potentials of benzene and some of its monosubstituted and 1,4-disubstituted derivatives,
J. Chem. Soc. B, 1968, 22. [all data]
Gautzsch and Zinn, 1996
Gautzsch, R.; Zinn, P.,
Use of incremental models to estimate the retention indexes of aromatic compounds,
Chromatographia, 1996, 43, 3/4, 163-176, https://doi.org/10.1007/BF02292946
. [all data]