3,5-Dinitrobenzotrifluoride
- Formula: C7H3F3N2O4
- Molecular weight: 236.1049
- IUPAC Standard InChIKey: QZADIXWDDVQVKM-UHFFFAOYSA-N
- CAS Registry Number: 401-99-0
- Chemical structure:
View 3d structure (requires JavaScript / HTML 5) - Other names: Benzene, 1,3-dinitro-5-(trifluoromethyl)-; 1,3-Dinitro-5-trifluoromethyl-benzene; α,α,α-trifluoro-3,5-dinitrotoluene

Reaction thermochemistry data

Data compiled as indicated in comments:
B - John E. Bartmess
M - Michael M. Meot-Ner (Mautner) and Sharon G. Lias
Individual Reactions
By formula: Br- + C7H3F3N2O4 = (Br- • C7H3F3N2O4)
Quantity | Value | Units | Method | Reference | Comment |
---|---|---|---|---|---|
ΔrH° | 82.8 ± 7.5 | kJ/mol | IMRE | Paul and Kebarle, 1991 | gas phase; ΔGaff at 423 K, ΔSaff taken as that of mCF3-nitrobenzene..Br-; B,M |
Quantity | Value | Units | Method | Reference | Comment |
ΔrS° | 92. | J/mol*K | N/A | Paul and Kebarle, 1991 | gas phase; 3,5-dinitrobenzofluoride, Entropy change calculated or estimated; M |
Quantity | Value | Units | Method | Reference | Comment |
ΔrG° | 43.5 ± 4.2 | kJ/mol | IMRE | Paul and Kebarle, 1991 | gas phase; ΔGaff at 423 K, ΔSaff taken as that of mCF3-nitrobenzene..Br-; B |
Free energy of reaction
ΔrG° (kJ/mol) | T (K) | Method | Reference | Comment |
---|---|---|---|---|
43.5 | 423. | PHPMS | Paul and Kebarle, 1991 | gas phase; 3,5-dinitrobenzofluoride, Entropy change calculated or estimated; M |

Gas phase ion energetics data

Data compiled by: John E. Bartmess
Electron affinity determinations
EA (eV) | Method | Reference | Comment |
---|---|---|---|
1.987 ± 0.065 | IMRB | Sharpe, Alameddin, et al., 1994 | EA given is actually -ΔGea(350 K) |

Ion clustering data

Data compiled as indicated in comments:
B - John E. Bartmess
M - Michael M. Meot-Ner (Mautner) and Sharon G. Lias
Clustering reactions
By formula: Br- + C7H3F3N2O4 = (Br- • C7H3F3N2O4)
Quantity | Value | Units | Method | Reference | Comment |
---|---|---|---|---|---|
ΔrH° | 82.8 ± 7.5 | kJ/mol | IMRE | Paul and Kebarle, 1991 | gas phase; ΔGaff at 423 K, ΔSaff taken as that of mCF3-nitrobenzene..Br-; B,M |
Quantity | Value | Units | Method | Reference | Comment |
ΔrS° | 92. | J/mol*K | N/A | Paul and Kebarle, 1991 | gas phase; 3,5-dinitrobenzofluoride, Entropy change calculated or estimated; M |
Quantity | Value | Units | Method | Reference | Comment |
ΔrG° | 43.5 ± 4.2 | kJ/mol | IMRE | Paul and Kebarle, 1991 | gas phase; ΔGaff at 423 K, ΔSaff taken as that of mCF3-nitrobenzene..Br-; B |
Free energy of reaction
ΔrG° (kJ/mol) | T (K) | Method | Reference | Comment |
---|---|---|---|---|
43.5 | 423. | PHPMS | Paul and Kebarle, 1991 | gas phase; 3,5-dinitrobenzofluoride, Entropy change calculated or estimated; M |

References

Paul and Kebarle, 1991
Paul, G.J.C.; Kebarle, P.,
Stabilities of Complexes of Br- with Substituted Benzenes (SB) Based on Determinations of the Gas-Phase Equilibria Br- + SB = (BrSB)-,
J. Am. Chem. Soc., 1991, 113, 4, 1148, https://doi.org/10.1021/ja00004a014
. [all data]
Sharpe, Alameddin, et al., 1994
Sharpe, P.; Alameddin, N.G.; Richardson, D.E.,
Alkyl Substituent Effects in the Redox Thermochemistry of Coordination Compounds: Oxidation and Reduction Energetics for Ruthenium tris(b-diketonate) Complexes,
J. Am. Chem. Soc., 1994, 116, 24, 11098, https://doi.org/10.1021/ja00103a027
. [all data]