Trifluoromethylcyclohexane
- Formula: C7H11F3
- Molecular weight: 152.1574
- IUPAC Standard InChIKey: QXPZOKVSFMRGMQ-UHFFFAOYSA-N
- CAS Registry Number: 401-75-2
- Chemical structure:
View 3d structure (requires JavaScript / HTML 5) - Permanent link for this species. Use this link for bookmarking this species for future reference.

Gas phase ion energetics data

Data compiled by: Henry M. Rosenstock, Keith Draxl, Bruce W. Steiner, and John T. Herron
Ionization energy determinations
IE (eV) | Method | Reference |
---|---|---|
10.46 ± 0.02 | PI | Watanabe, Nakayama, et al., 1962 |

References

Watanabe, Nakayama, et al., 1962
Watanabe, K.; Nakayama, T.; Mottl, J.,
Ionization potentials of some molecules,
J. Quant. Spectry. Radiative Transfer, 1962, 2, 369. [all data]