[1,2]Oxathiolo[2,3-b][1,2]oxathiole-7-s(iv)

Gas phase ion energetics data

Data compiled by: Sharon G. Lias, Rhoda D. Levin, and Sherif A. Kafafi

Ionization energy determinations

IE (eV) Method Reference Comment
8.58PEGleiter, Gygax, et al., 1975Vertical value

References

Gleiter, Gygax, et al., 1975
Gleiter, R.; Gygax, R.; Reid, D.H., The He 584A photoelectron spectra of analoga of thiathiophthene, Helv. Chim. Acta, 1975, 58, 1591. [all data]