Benzene,1,4-dichloro-2,5-dimethyl-3,6-dinitro-
- Formula: C8H6Cl2N2O4
- Molecular weight: 265.050
- IUPAC Standard InChIKey: HYRAGOBKBZGFKS-UHFFFAOYSA-N
- CAS Registry Number: 40115-57-9
- Chemical structure:
View 3d structure (requires JavaScript / HTML 5) - Permanent link for this species. Use this link for bookmarking this species for future reference.

Gas phase ion energetics data

Data compiled by: Sharon G. Lias, Rhoda D. Levin, and Sherif A. Kafafi
Ionization energy determinations
IE (eV) | Method | Reference |
---|---|---|
9.47 ± 0.02 | PI | Potapov, Kardash, et al., 1972 |

References

Potapov, Kardash, et al., 1972
Potapov, V.K.; Kardash, I.E.; Sorokin, V.V.; Sokolov, S.A.; Evlasheva, T.I.,
Photoionization of heteroaromatic compounds,
Khim. Vys. Energ., 1972, 6, 392. [all data]