4-Methyl-1,3-heptadiene, trans
- Formula: C8H14
- Molecular weight: 110.1968
- IUPAC Standard InChIKey: AHWGKLXMXHPYBI-SOFGYWHQSA-N
- CAS Registry Number: 40095-05-4
- Chemical structure:
View 3d structure (requires JavaScript / HTML 5) - Stereoisomers:
- Other names: (E)-1,3-Heptadiene, 4-methyl-

Gas phase ion energetics data

Data compiled as indicated in comments:
LLK - Sharon G. Lias, Rhoda D. Levin, and Sherif A. Kafafi
Ionization energy determinations
IE (eV) | Method | Reference | Comment |
---|---|---|---|
8.02 | PE | Masclet, Mouvier, et al., 1981 | LLK |

References

Masclet, Mouvier, et al., 1981
Masclet, P.; Mouvier, G.; Bocquet, J.F.,
Effets electroniques et effets steriques dus a la substitution alcoyle dans les dienes conjugues,
J. Chim. Phys., 1981, 78, 99. [all data]