Zinc, bis(hexamethyldisilylamide)
- Formula: C12H36N2Si4Zn
- Molecular weight: 386.15
- CAS Registry Number: 3999-27-7

Gas phase thermochemistry data

Data compiled by: José A. Martinho Simões
Quantity | Value | Units | Method | Reference | Comment |
---|---|---|---|---|---|
ΔfH°gas | -881. ± 13. | kJ/mol | Review | Martinho Simões | The uncertainty assigned to the enthalpy of formation has been estimated in Gümrükçüoglü, Jeffery, et al., 1988. |
ΔfH°gas | -893. ± 13. | kJ/mol | Review | Martinho Simões | The uncertainty assigned to the enthalpy of formation has been estimated in Gümrükçüoglü, Jeffery, et al., 1988. |
ΔfH°gas | -887. ± 12. | kJ/mol | Review | Martinho Simões | Selected data. |

Condensed phase thermochemistry data

Data compiled by: José A. Martinho Simões
Quantity | Value | Units | Method | Reference | Comment |
---|---|---|---|---|---|
ΔfH°liquid | -949. ± 9. | kJ/mol | Review | Martinho Simões | The uncertainty assigned to the enthalpy of formation has been estimated in Gümrükçüoglü, Jeffery, et al., 1988. |
ΔfH°liquid | -961. ± 9. | kJ/mol | Review | Martinho Simões | The uncertainty assigned to the enthalpy of formation has been estimated in Gümrükçüoglü, Jeffery, et al., 1988. |
ΔfH°liquid | -955. ± 6. | kJ/mol | Review | Martinho Simões | Selected data. |

Gas phase ion energetics data

Data compiled by: Sharon G. Lias, Rhoda D. Levin, and Sherif A. Kafafi
Ionization energy determinations
IE (eV) | Method | Reference | Comment |
---|---|---|---|
8.50 ± 0.05 | PE | Harris, Lappert, et al., 1976 | Vertical value |

Phase change data

Data compiled by: José A. Martinho Simões
Quantity | Value | Units | Method | Reference | Comment |
---|---|---|---|---|---|
ΔvapH° | 16.3 ± 2.4 | kcal/mol | RSC | Gümrükçüoglü, Jeffery, et al., 1988 |

References

Martinho Simões
Martinho Simões, J.A.,
Private communication (see http://webbook.nist.gov/chemistry/om/). [all data]
Gümrükçüoglü, Jeffery, et al., 1988
Gümrükçüoglü, I.E.; Jeffery, J.; Lappert, M.F.; Pedley, J.B.; Rai A.K.,
J. Organometal. Chem., 1988, 341, 53. [all data]
Harris, Lappert, et al., 1976
Harris, D.H.; Lappert, M.F.; Pedley, J.B.; Sharp, G.J.,
Bonding studies of compounds of group 3-5 elements. Part XVIII. He(I) photoelectron spectra of bivalent homoleptic alkyls and amides, especially of group 4 elements, and of tin(II) chloride and bromide,
J. Chem. Soc. Dalton Trans., 1976, 945. [all data]