1,2,4-Pentatriene, 3,4-dimethyl-
- Formula: C7H10
- Molecular weight: 94.1543
- IUPAC Standard InChIKey: ATYAQOOUEXVKPZ-UHFFFAOYSA-N
- CAS Registry Number: 39968-66-6
- Chemical structure:
View 3d structure (requires JavaScript / HTML 5) - Permanent link for this species. Use this link for bookmarking this species for future reference.

Gas phase ion energetics data

Data compiled by: Sharon G. Lias, Rhoda D. Levin, and Sherif A. Kafafi
Ionization energy determinations
IE (eV) | Method | Reference | Comment |
---|---|---|---|
8.10 | PE | Delwiche, Praet, et al., 1979 | Vertical value |

References

Delwiche, Praet, et al., 1979
Delwiche, J.; Praet, M.-Th.; Caprace, G.; Franskin-Hubin, M.-J.; Natalis, P.; Collin, J.E.,
The HeI photoelectron spectra of methyl-substituted 1,2,4-pentatrienes (vinylallene),
J. Electron Spectrosc. Relat. Phenom., 1979, 16, 35. [all data]