[1,2,4]Triazolo[1,5-a]pyrazine
- Formula: C5H4N4
- Molecular weight: 120.1121
- IUPAC Standard InChIKey: DFDJVPRVKHSWQH-UHFFFAOYSA-N
- CAS Registry Number: 399-66-6
- Chemical structure:
View 3d structure (requires JavaScript / HTML 5) - Other names: s-Triazolo[1,5-a]pyrazine

Gas phase ion energetics data

Data compiled by: Sharon G. Lias, Rhoda D. Levin, and Sherif A. Kafafi
Ionization energy determinations
IE (eV) | Method | Reference | Comment |
---|---|---|---|
9.6 | PE | Lin, Yu, et al., 1980 | Vertical value |

Normal alkane RI, polar column, temperature ramp

Column type | Active phase | I | Reference | Comment |
---|---|---|---|---|
Capillary | FFAP | 1675. | Nebesny, Budryn, et al., 2007 | 30. m/0.32 mm/0.5 μm, N2, 35. C @ 5. min, 4. K/min, 320. C @ 45. min |

References

Lin, Yu, et al., 1980
Lin, J.; Yu, C.; Peng, S.; Akiyama, I.; Li, K.; Lee, L.K.; LeBreton, P.R.,
Ultraviolet photoelectron studies of the ground-state electronic structure and gas-phase tautomerism of purine and adenine,
J. Am. Chem. Soc., 1980, 102, 4627. [all data]
Nebesny, Budryn, et al., 2007
Nebesny, E.; Budryn, G.; Kula, J.; Majda, T.,
The effect of roasting method on headspace composition of robusta coffee bean aroma,
Eur. Food Res. Technol., 2007, 225, 1, 9-19, https://doi.org/10.1007/s00217-006-0375-0
. [all data]