Acetamide,N-(2,4-difluorophenyl)-
- Formula: C8H7F2NO
- Molecular weight: 171.1441
- IUPAC Standard InChIKey: WOHLPEUHFSHZAN-UHFFFAOYSA-N
- CAS Registry Number: 399-36-0
- Chemical structure:
View 3d structure (requires JavaScript / HTML 5) - Other names: Aminobenzene, N-acetyl-2,4-difluoro-; 2',4'-difluoroacetanilide

Gas phase ion energetics data

Data compiled by: Sharon G. Lias, Rhoda D. Levin, and Sherif A. Kafafi
Ionization energy determinations
IE (eV) | Method | Reference |
---|---|---|
8.21 ± 0.03 | EI | Benezra and Bursey, 1972 |
Appearance energy determinations
Ion | AE (eV) | Other Products | Method | Reference | Comment |
---|---|---|---|---|---|
C2H3O+ | 13.18 ± 0.03 | ? | EI | Benezra and Bursey, 1972 | |
C6H5NF2+ | 9.70 ± 0.03 | CH2=C=O | EI | Benezra and Bursey, 1972 |

References

Benezra and Bursey, 1972
Benezra, S.A.; Bursey, M.M.,
ortho-Effects in mass spectra. Alteration of the molecular-ion energy distribution in disubstituted acetanilides,
Z. Naturforsch. A:, 1972, 27, 670. [all data]