Acetamide, N-(2-fluorophenyl)-
- Formula: C8H8FNO
- Molecular weight: 153.1536
- IUPAC Standard InChIKey: AUZPZBPZWHEIDY-UHFFFAOYSA-N
- CAS Registry Number: 399-31-5
- Chemical structure:
View 3d structure (requires JavaScript / HTML 5) - Other names: 2'-Fluoroacetanilide; N-(2-fluorophenyl)acetamide

Phase change data

Data compiled by: Robert L. Brown and Stephen E. Stein
Reduced pressure boiling point
Tboil (K) | Pressure (bar) | Reference |
---|---|---|
414.2 | 0.019 | Aldrich Chemical Company Inc., 1990 |
413. to 415. | 0.019 | PCR Inc., 1990 |

Gas phase ion energetics data

Data compiled by: Sharon G. Lias, Rhoda D. Levin, and Sherif A. Kafafi
Ionization energy determinations
IE (eV) | Method | Reference |
---|---|---|
8.65 | EI | Baldwin, Loudon, et al., 1976 |
8.27 ± 0.03 | EI | Benezra and Bursey, 1971 |
Appearance energy determinations
Ion | AE (eV) | Other Products | Method | Reference | Comment |
---|---|---|---|---|---|
C2H3O+ | 13.59 ± 0.03 | ? | EI | Benezra and Bursey, 1971 | |
C6H6NF+ | 9.80 ± 0.03 | CH2=C=O | EI | Benezra and Bursey, 1971 |

References

Aldrich Chemical Company Inc., 1990
Aldrich Chemical Company Inc.,
Catalog Handbook of Fine Chemicals, Aldrich Chemical Company, Inc., Milwaukee WI, 1990, 1. [all data]
PCR Inc., 1990
PCR Inc.,
Research Chemicals Catalog 1990-1991, PCR Inc., Gainesville, FL, 1990, 1. [all data]
Baldwin, Loudon, et al., 1976
Baldwin, M.A.; Loudon, A.G.; Maccoll, A.; Webb, K.S.,
The nature and fragmentation pathways of the molecular ions of some arylureas, arylthioureas, acetanilides, thioacetanilides and related compounds,
Org. Mass Spectrom., 1976, 11, 1181. [all data]
Benezra and Bursey, 1971
Benezra, S.A.; Bursey, M.M.,
ortho-Effects on ordering factors in mass spectral rearrangements. Loss of keten from halogenated phenyl acetates and acetanilides,
J. Chem. Soc. B, 1971, 1515. [all data]