3-Hepten-2-one, 3-methyl-
- Formula: C8H14O
- Molecular weight: 126.1962
- IUPAC Standard InChIKey: IZBMUZVSTLWUTH-VOTSOKGWSA-N
- CAS Registry Number: 39899-08-6
- Chemical structure:
View 3d structure (requires JavaScript / HTML 5) - Other names: n-C3H7CH=C(CH3)C(=O)CH3

Gas phase ion energetics data

Data compiled as indicated in comments:
LLK - Sharon G. Lias, Rhoda D. Levin, and Sherif A. Kafafi
Ionization energy determinations
IE (eV) | Method | Reference | Comment |
---|---|---|---|
9.22 | PE | Masclet and Mouvier, 1978 | LLK |

References

Masclet and Mouvier, 1978
Masclet, P.; Mouvier, G.,
Etude par spectrometrie photoelectronique d'aldehydes et de cetones ethyleniques conjugues,
J. Electron Spectrosc. Relat. Phenom., 1978, 14, 77. [all data]