Thiophene,2,2'-thiobis-
- Formula: C8H6S3
- Molecular weight: 198.328
- IUPAC Standard InChIKey: AKYIWBKPINOXJY-UHFFFAOYSA-N
- CAS Registry Number: 3988-99-6
- Chemical structure:
View 3d structure (requires JavaScript / HTML 5) - Other names: 2-(2-Thienylthio)thiophene

Gas phase ion energetics data

Data compiled by: Sharon G. Lias, Rhoda D. Levin, and Sherif A. Kafafi
Ionization energy determinations
IE (eV) | Method | Reference | Comment |
---|---|---|---|
8.40 | PE | Meunier and Pfister-Guillouzo, 1977 | Vertical value |

References

Meunier and Pfister-Guillouzo, 1977
Meunier, P.; Pfister-Guillouzo, G.,
Etude conformationnelle par spectroscopie photoelectronique de sulfures de bithienyle,
Can. J. Chem., 1977, 55, 3901. [all data]