2',3',5'-Tri-o-methyluridine
- Formula: C12H18N2O6
- Molecular weight: 286.2811
- IUPAC Standard InChIKey: CQSANRRCLONMRY-ASXGKARISA-N
- CAS Registry Number: 39848-57-2
- Chemical structure:
View 3d structure (requires JavaScript / HTML 5) - Permanent link for this species. Use this link for bookmarking this species for future reference.

Gas phase ion energetics data

Data compiled by: Sharon G. Lias, Rhoda D. Levin, and Sherif A. Kafafi
Ionization energy determinations
IE (eV) | Method | Reference | Comment |
---|---|---|---|
8.46 | PE | Yu, O'Donnell, et al., 1981 | |
8.96 | PE | Yu, O'Donnell, et al., 1981 | Vertical value |

References

Yu, O'Donnell, et al., 1981
Yu, C.; O'Donnell, T.J.; LeBreton, P.R.,
Ultraviolet photoelectron studies of volatile nucleoside models. Vertical ionization potential measurements of methylated uridine, thymidine, cytidine, and adenosine,
J. Phys. Chem., 1981, 85, 3851. [all data]