Cyclohexene,1-(2-methylpropyl)-
- Formula: C10H18
- Molecular weight: 138.2499
- IUPAC Standard InChIKey: NQIVPQHOBXSALG-UHFFFAOYSA-N
- CAS Registry Number: 3983-03-7
- Chemical structure:
View 3d structure (requires JavaScript / HTML 5) - Other names: 1-Isobutylcyclohexene-1; 1-Isobutyl-1-cyclohexene

Gas phase ion energetics data

Data compiled by: Sharon G. Lias, Rhoda D. Levin, and Sherif A. Kafafi
Ionization energy determinations
IE (eV) | Method | Reference |
---|---|---|
8.40 ± 0.01 | PE | Rang, Paldoia, et al., 1974 |

Kovats' RI, non-polar column, isothermal

Column type | Active phase | Temperature (C) | I | Reference | Comment |
---|---|---|---|---|---|
Packed | Squalane | 80. | 1001. | Bogoslovsky, Anvaer, et al., 1978 | |
Capillary | Squalane | 100. | 1005. | Rang, Orav, et al., 1977 | Nitrogen or helium; Column length: 100. m; Column diameter: 0.25 mm |
Capillary | Apiezon L | 100. | 1031. | Eisen, Orav, et al., 1972 | Column length: 45. m; Column diameter: 0.25 mm |
Capillary | Apiezon L | 120. | 1040. | Eisen, Orav, et al., 1972 | Column length: 45. m; Column diameter: 0.25 mm |
Capillary | Squalane | 60. | 1000.9 | Eisen, Orav, et al., 1972 | Column length: 80. m; Column diameter: 0.25 mm |
Capillary | Squalane | 80. | 1000.9 | Eisen, Orav, et al., 1972 | Column length: 80. m; Column diameter: 0.25 mm |

Kovats' RI, polar column, isothermal

Column type | Active phase | Temperature (C) | I | Reference | Comment |
---|---|---|---|---|---|
Capillary | PEG 4000 | 100. | 1129. | Rang, Orav, et al., 1988 | |
Capillary | PEG 4000 | 110. | 1140. | Rang, Orav, et al., 1988 | |
Capillary | PEG 4000 | 120. | 1144. | Rang, Orav, et al., 1988 | |
Capillary | PEG 4000 | 150. | 1159. | Rang, Orav, et al., 1988 | |
Capillary | PEG 4000 | 80. | 1118. | Rang, Orav, et al., 1988 | |
Capillary | PEG 4000 | 100. | 1129. | Rang, Orav, et al., 1977 | Nitrogen or Helium; Column length: 45. m; Column diameter: 0.25 mm |
Capillary | Polyethylene Glycol 4000 | 100. | 1141.4 | Eisen, Orav, et al., 1972 | Column length: 80. m; Column diameter: 0.25 mm |
Capillary | Polyethylene Glycol 4000 | 60. | 1119.8 | Eisen, Orav, et al., 1972 | Column length: 80. m; Column diameter: 0.25 mm |
Capillary | Polyethylene Glycol 4000 | 80. | 1130.8 | Eisen, Orav, et al., 1972 | Column length: 80. m; Column diameter: 0.25 mm |

Normal alkane RI, non-polar column, custom temperature program

Column type | Active phase | I | Reference | Comment |
---|---|---|---|---|
Capillary | Squalane | 1003. | Chen, 2008 | Program: not specified |

References

Rang, Paldoia, et al., 1974
Rang, S.; Paldoia, P.; Talvari, A.,
Ionization potentials of unsaturated hydrocarbons. 2. Mono-substituted cyclopentenes and cyclohexenes,
Eesti. NSV Tead. Akad. Toim., 1974, 354. [all data]
Bogoslovsky, Anvaer, et al., 1978
Bogoslovsky, Yu.N.; Anvaer, B.I.; Vigdergauz, M.S.,
Chromatographic constants in gas chromatography (in Russian), Standards Publ. House, Moscow, 1978, 192. [all data]
Rang, Orav, et al., 1977
Rang, S.; Orav, A.; Kuningas, K.; Eisen, O.,
Capillary Gas Chromatography of Monosubstituted Cyclopentenes and Cyclohexenes,
Chromatographia, 1977, 10, 3, 115-122, https://doi.org/10.1007/BF02297862
. [all data]
Eisen, Orav, et al., 1972
Eisen, O.; Orav, A.; Rang, S.,
Identifizierung von Normal-Alkenen, Cyclopentenen und -Hexenen mittels Kapillar-Gas-Chromatographie. Identification des alcènes, cyclopentènes et -hexènes à l'aide de la chromatogrpahie en phase gazeuse sur colonne capillaire,
Chromatographia, 1972, 5, 11, 229-239, https://doi.org/10.1007/BF02270600
. [all data]
Rang, Orav, et al., 1988
Rang, S.A.; Orav, A.E.; Kuningas, K.R.; Meister, A.E.; Strense, T.V.; Eisen, O.G.,
Gas-Chromatographic Characteristics of unsaturated hydrocarbons, Academy of Sciences of Estonia SSR, Tallinn, Estonia SSR, 1988, 208. [all data]
Chen, 2008
Chen, H.-F.,
Quantitative prediction of gas chromatography retention indices with support vector machines, radial basis neutral networks and multiple linear regression,
Anal. Chim. Acta, 2008, 609, 1, 24-36, https://doi.org/10.1016/j.aca.2008.01.003
. [all data]