Thiophosphoryl chloride
- Formula: Cl3PS
- Molecular weight: 169.398
- IUPAC Standard InChIKey: WQYSXVGEZYESBR-UHFFFAOYSA-N
- CAS Registry Number: 3982-91-0
- Chemical structure:
View 3d structure (requires JavaScript / HTML 5) - Other names: thiophosphoryl trichloride

Gas phase thermochemistry data

Quantity | Value | Units | Method | Reference | Comment |
---|---|---|---|---|---|
ΔfH°gas | -380.74 | kJ/mol | Review | Chase, 1998 | Data last reviewed in September, 1962 |
Quantity | Value | Units | Method | Reference | Comment |
S°gas,1 bar | 337.26 | J/mol*K | Review | Chase, 1998 | Data last reviewed in September, 1962 |
Gas Phase Heat Capacity (Shomate Equation)
Cp° = A + B*t + C*t2 + D*t3 +
E/t2
H° − H°298.15= A*t + B*t2/2 +
C*t3/3 + D*t4/4 − E/t + F − H
S° = A*ln(t) + B*t + C*t2/2 + D*t3/3 −
E/(2*t2) + G
Cp = heat capacity (J/mol*K)
H° = standard enthalpy (kJ/mol)
S° = standard entropy (J/mol*K)
t = temperature (K) / 1000.
View plot Requires a JavaScript / HTML 5 canvas capable browser.
Temperature (K) | 298. to 6000. |
---|---|
A | 105.4837 |
B | 2.204760 |
C | -0.594785 |
D | 0.050616 |
E | -1.480012 |
F | -417.2494 |
G | 455.9514 |
H | -380.7444 |
Reference | Chase, 1998 |
Comment | Data last reviewed in September, 1962 |

Phase change data

Antoine Equation Parameters
log10(P) = A − (B / (T + C))
P = vapor pressure (bar)
T = temperature (K)
View plot Requires a JavaScript / HTML 5 canvas capable browser.
Temperature (K) | A | B | C | Reference | Comment |
---|---|---|---|---|---|
254.9 to 397. | 4.35678 | 1553.827 | -39.972 | Stull, 1947 | Coefficents calculated by NIST from author's data. |

Reaction thermochemistry data

Data compiled by: John E. Bartmess
Individual Reactions
+
= Cl4PS-
By formula: Cl- + Cl3PS = Cl4PS-
Quantity | Value | Units | Method | Reference | Comment |
---|---|---|---|---|---|
ΔrH° | 41.0 ± 4.0 | kJ/mol | CIDT | Check, Lobring, et al., 2003 | gas phase |

Gas phase ion energetics data

Data compiled by: Sharon G. Lias, Rhoda D. Levin, and Sherif A. Kafafi
Ionization energy determinations
IE (eV) | Method | Reference | Comment |
---|---|---|---|
9.71 ± 0.03 | PE | Vilesov, Lopatin, et al., 1974 | |
9.71 ± 0.003 | PE | Vovna, Lopatin, et al., 1973 | |
10.15 | PE | Zverev, Vilesov, et al., 1975 | Vertical value |
10.15 | PE | Vovna, Lopatin, et al., 1974 | Vertical value |
10.11 | PE | Berkosky, Ellison, et al., 1973 | Vertical value |
10.13 ± 0.03 | PE | Cox, Evans, et al., 1972 | Vertical value |

Ion clustering data

Data compiled by: John E. Bartmess
Clustering reactions
+
= Cl4PS-
By formula: Cl- + Cl3PS = Cl4PS-
Quantity | Value | Units | Method | Reference | Comment |
---|---|---|---|---|---|
ΔrH° | 41.0 ± 4.0 | kJ/mol | CIDT | Check, Lobring, et al., 2003 | gas phase |

Vibrational and/or electronic energy levels

Data compiled by: Takehiko Shimanouchi
Symmetry: C3ν Symmetry Number σ = 3
Sym. | No | Approximate | Selected Freq. | Infrared | Raman | Comments | ||||
---|---|---|---|---|---|---|---|---|---|---|
Species | type of mode | Value | Rating | Value | Phase | Value | Phase | |||
a1 | 1 | PS str | 767 | B | 770 | gas | 767.2 p | gas | ||
a1 | 2 | PCl3 s-str | 432 | B | 431 | gas | 431.6 p | gas | ||
a1 | 3 | PCl3 s-deform | 246 | C | 252 | gas | 246.0 dp | gas | OV(ν5) | |
e | 4 | PCl3 d-str | 544 | C | 547 | gas | 543.7 dp | gas | ||
e | 5 | PCl3 d-deform | 246 | C | 252 | gas | 246 dp | gas | OV(ν3) | |
e | 6 | PCl3 rock | 167 | C | 174 | liq. | 167.3 dp | gas | ||
Source: Shimanouchi, 1972

References

Chase, 1998
Chase, M.W., Jr.,
NIST-JANAF Themochemical Tables, Fourth Edition,
J. Phys. Chem. Ref. Data, Monograph 9, 1998, 1-1951. [all data]
Stull, 1947
Stull, Daniel R.,
Vapor Pressure of Pure Substances. Organic and Inorganic Compounds,
Ind. Eng. Chem., 1947, 39, 4, 517-540, https://doi.org/10.1021/ie50448a022
. [all data]
Check, Lobring, et al., 2003
Check, C.E.; Lobring, K.C.; Keating, P.R.; Gilbert, T.M.; Sunderlin, L.S.,
Effect of substituents on the strength of hypervalent phosphorus-halogen bonds,
J. Phys. Chem. A, 2003, 107, 42, 8961-8967, https://doi.org/10.1021/jp030287x
. [all data]
Vilesov, Lopatin, et al., 1974
Vilesov, F.I.; Lopatin, S.N.; Vovna, V.I.; Paetzold, R.; Niendorf, K.,
Untersuchungen an molekulkomplexen. 3. Mitteilung: Zusammenhang zwischen der ionisierungsenergie von R1R2R3PS-molekulen und der stabilitat ihrer molekulkomplexe mit jod,
Z. Phys. Chem. (Leipzig), 1974, 255, 661. [all data]
Vovna, Lopatin, et al., 1973
Vovna, V.I.; Lopatin, S.N.; Pettsold, R.; Vilesov, F.I.; Akopyan, M.E.,
Photoelectron spectra of thiophosphorylchloride and some of its aminosubstituted derivatives,
Opt. Spectrosc., 1973, 34, 501, In original 868. [all data]
Zverev, Vilesov, et al., 1975
Zverev, V.V.; Vilesov, F.I.; Vovna, V.I.; Lopatin, S.N.; Kitaev, Y.P.,
Photoelectron spectra,
Izv. Akad. Nauk SSSR, Ser. Khim., 1975, 1975, 1051. [all data]
Vovna, Lopatin, et al., 1974
Vovna, V.I.; Lopatin, S.N.; Pettsold, R.; Vilesov, F.I.; Akopyan, M.E.,
Photoelectron spectra of a number of substitution products of thiophosphoryl chloride,
Opt. Spectrosc., 1974, 36, 99. [all data]
Berkosky, Ellison, et al., 1973
Berkosky, J.L.; Ellison, F.O.; Lee, T.H.; Rabalais, J.W.,
Model for calculating spin-orbit interactions with applications to photoelectron spectroscopy,
J. Chem. Phys., 1973, 59, 5342. [all data]
Cox, Evans, et al., 1972
Cox, P.A.; Evans, S.; Orchard, A.F.; Richardson, N.V.; Roberts, P.J.,
Simple quantitative molecular orbital methods used in connection with photoelectron spectroscopy,
Faraday Discuss. Chem. Soc., 1972, 54, 26. [all data]
Shimanouchi, 1972
Shimanouchi, T.,
Tables of Molecular Vibrational Frequencies Consolidated Volume II,
J. Phys. Chem. Ref. Data, 1972, 6, 3, 993-1102. [all data]