Biphenyl, 4-bromo-4'-fluoro-
- Formula: C12H8BrF
- Molecular weight: 251.094
- IUPAC Standard InChIKey: XFGPSHWWPIFPNL-UHFFFAOYSA-N
- CAS Registry Number: 398-21-0
- Chemical structure:
View 3d structure (requires JavaScript / HTML 5) - Other names: 4-bromo-4'-fluoro-1,1'-biphenyl; 4-Bromo-4'-fluorobiphenyl

Gas phase ion energetics data

Data compiled by: Sharon G. Lias, Rhoda D. Levin, and Sherif A. Kafafi
Ionization energy determinations
IE (eV) | Method | Reference |
---|---|---|
8.10 ± 0.02 | PE | Maier and Turner, 1972 |

References

Maier and Turner, 1972
Maier, J.P.; Turner, D.W.,
Steric inhibition of resonance studied by molecular photoelectron spectroscopy. Part I. Biphenyls,
Faraday Discuss. Chem. Soc., 1972, 54, 149. [all data]