8H-Cyclohepta[b]naphthalen-8-one,7,9-dimethyl-
- Formula: C17H14O
- Molecular weight: 234.2925
- IUPAC Standard InChIKey: GHLLBBHANFDRHR-UHFFFAOYSA-N
- CAS Registry Number: 39787-00-3
- Chemical structure:
View 3d structure (requires JavaScript / HTML 5) - Permanent link for this species. Use this link for bookmarking this species for future reference.

Gas phase ion energetics data

Data compiled by: Sharon G. Lias, Rhoda D. Levin, and Sherif A. Kafafi
Ionization energy determinations
IE (eV) | Method | Reference | Comment |
---|---|---|---|
7.83 ± 0.03 | PE | Allan, Heilbronner, et al., 1975 | Vertical value |

References

Allan, Heilbronner, et al., 1975
Allan, M.; Heilbronner, E.; Kloster-Jensen, E.,
A photoelectron-spectroscopic investigation of benzologue tropones,
J. Electron Spectrosc. Relat. Phenom., 1975, 6, 181. [all data]