Tricyclo[4.2.0.0<sup>2,5</sup>]oct-3-ene,(1α,2β,5β,6α)-
- Formula: C8H10
- Molecular weight: 106.1650
- IUPAC Standard InChIKey: YHCXYJYRBADQSN-UHFFFAOYSA-N
- CAS Registry Number: 39781-76-5
- Chemical structure:
View 3d structure (requires JavaScript / HTML 5) - Other names: Tricyclo[4.2.0.02,5]oct-3-ene,(1α,2β,5β,6α)-

Gas phase ion energetics data

Data compiled by: Sharon G. Lias, Rhoda D. Levin, and Sherif A. Kafafi
Ionization energy determinations
IE (eV) | Method | Reference | Comment |
---|---|---|---|
9.25 | PE | Gleiter, Heilbronner, et al., 1973 | Vertical value |

References

Gleiter, Heilbronner, et al., 1973
Gleiter, R.; Heilbronner, E.; Hekman, M.; Martin, H.-D.,
π-Orbital-Wechselwirkungen "through space" and "through bond" in tricyclo[4.2.0.02,5]octadienen,
Chem. Ber., 1973, 106, 28. [all data]