Phosphinoline,2-phenyl-
- Formula: C15H11P
- Molecular weight: 222.2216
- IUPAC Standard InChIKey: CCHDKJHAJDPLPN-UHFFFAOYSA-N
- CAS Registry Number: 39768-04-2
- Chemical structure:
View 3d structure (requires JavaScript / HTML 5) - Permanent link for this species. Use this link for bookmarking this species for future reference.

Gas phase ion energetics data

Data compiled by: Sharon G. Lias, Rhoda D. Levin, and Sherif A. Kafafi
Ionization energy determinations
IE (eV) | Method | Reference |
---|---|---|
7.65 | PE | Schafer, Schweig, et al., 1973 |

References

Schafer, Schweig, et al., 1973
Schafer, W.; Schweig, A.; Markl, G.; Heier, K.-H.,
Zur elektronenstruktur der lambda3- und lambda5-phosphanaphthaline--ungewohnlich grosse MO destabilisierungen,
Tetrahedron Lett., 1973, 3743. [all data]