2,4,6-Tri-t-butyl-1-bromobenzene
- Formula: C18H29Br
- Molecular weight: 325.327
- IUPAC Standard InChIKey: JOKZWHPYNRDCOA-UHFFFAOYSA-N
- CAS Registry Number: 3975-77-7
- Chemical structure:
View 3d structure (requires JavaScript / HTML 5) - Permanent link for this species. Use this link for bookmarking this species for future reference.

Gas phase ion energetics data

Data compiled as indicated in comments:
LBLHLM - Sharon G. Lias, John E. Bartmess, Joel F. Liebman, John L. Holmes, Rhoda D. Levin, and W. Gary Mallard
Ionization energy determinations
IE (eV) | Method | Reference | Comment |
---|---|---|---|
8.0 | PE | Cetinkaya, Lappert, et al., 1983 | LBLHLM |
8.2 | PE | Cetinkaya, Lappert, et al., 1983 | Vertical value; LBLHLM |

References

Cetinkaya, Lappert, et al., 1983
Cetinkaya, B.; Lappert, M.F.; Suffolk, R.J.,
Photoelectron spectra of some sterically hindered phenols and related compounds,
J. Chem. Res. Synop., 1983, 316. [all data]