Tricyclo[3.3.1.13,7]decane-2,6-dione
- Formula: C10H12O2
- Molecular weight: 164.2011
- IUPAC Standard InChIKey: UBIAKEDDKXHXTB-UHFFFAOYSA-N
- CAS Registry Number: 39751-07-0
- Chemical structure:
View 3d structure (requires JavaScript / HTML 5) - Species with the same structure:

Gas phase ion energetics data

Data compiled by: Sharon G. Lias, Rhoda D. Levin, and Sherif A. Kafafi
Ionization energy determinations
IE (eV) | Method | Reference | Comment |
---|---|---|---|
9.06 | PE | Worley, Mateescu, et al., 1973 | |
9.07 | PE | Kovac and Klasinc, 1978 | Vertical value |

References

Worley, Mateescu, et al., 1973
Worley, S.D.; Mateescu, G.D.; McFarland, C.W.; Fort, R.C., Jr.; Sheley, C.F.,
Photoelectron spectra and MINDO-SCF-MO calculations for adamantane and some of its derivatives,
J. Am. Chem. Soc., 1973, 95, 7580. [all data]
Kovac and Klasinc, 1978
Kovac, B.; Klasinc, L.,
Photoelectron spectroscopy of adamantane and some adamantanones,
Croat. Chem. Acta, 1978, 51, 55. [all data]