1-Chloro-4-(1,1-dimethylethyl)benzene
- Formula: C10H13Cl
- Molecular weight: 168.663
- IUPAC Standard InChIKey: XRTANKYQJQXSFP-UHFFFAOYSA-N
- CAS Registry Number: 3972-56-3
- Chemical structure:
View 3d structure (requires JavaScript / HTML 5) - Other names: Benzene, 1-chloro-4-(1,1-dimethylethyl)-; Benzene, 1-tert-butyl-4-chloro-; p-Chloro-tert-butylbenzene; 1-tert-Butyl-4-chlorobenzene; p-tert-Butylchlorobenzene; 4-Chloro-tert-butylbenzene; 4-tert-Butyl-chlorobenzene; 4-tert-butyl-1-chlorobenzene

Condensed phase thermochemistry data

Data compiled by: Hussein Y. Afeefy, Joel F. Liebman, and Stephen E. Stein
Quantity | Value | Units | Method | Reference | Comment |
---|---|---|---|---|---|
ΔfH°liquid | -108. ± 3. | kJ/mol | Eqk | Kovel, Nesterova, et al., 1982 |

Phase change data

Data compiled as indicated in comments:
BS - Robert L. Brown and Stephen E. Stein
TRC - Thermodynamics Research Center, NIST Boulder Laboratories, Chris Muzny director
Quantity | Value | Units | Method | Reference | Comment |
---|---|---|---|---|---|
Tboil | 484.2 | K | N/A | Weast and Grasselli, 1989 | BS |
Tboil | 485. | K | N/A | Benkeser, Crimmins, et al., 1968 | Uncertainty assigned by TRC = 5. K; TRC |
Tboil | 488. | K | N/A | Rueggeberg, Cushing, et al., 1946 | Uncertainty assigned by TRC = 3. K; TRC |

Reaction thermochemistry data

Data compiled by: Hussein Y. Afeefy, Joel F. Liebman, and Stephen E. Stein
Individual Reactions
By formula: C6H5Cl + C14H21Cl = C10H13Cl + C10H13Cl
Quantity | Value | Units | Method | Reference | Comment |
---|---|---|---|---|---|
ΔrH° | -0.25 ± 0.71 | kJ/mol | Eqk | Kovzel, Nesterova, et al., 1981 | liquid phase |
By formula: C10H13Cl = C10H13Cl
Quantity | Value | Units | Method | Reference | Comment |
---|---|---|---|---|---|
ΔrH° | 0.84 ± 0.42 | kJ/mol | Eqk | Kovzel, Nesterova, et al., 1981 | liquid phase |
By formula: C10H13Cl = C10H13Cl
Quantity | Value | Units | Method | Reference | Comment |
---|---|---|---|---|---|
ΔrH° | -21.4 ± 1.7 | kJ/mol | Eqk | Kovzel, Nesterova, et al., 1981 | liquid phase |

Gas phase ion energetics data

Data compiled as indicated in comments:
LBLHLM - Sharon G. Lias, John E. Bartmess, Joel F. Liebman, John L. Holmes, Rhoda D. Levin, and W. Gary Mallard
LLK - Sharon G. Lias, Rhoda D. Levin, and Sherif A. Kafafi
Ionization energy determinations
IE (eV) | Method | Reference | Comment |
---|---|---|---|
8.56 ± 0.02 | EI | Orlov, Misharev, et al., 1986 | LBLHLM |
8.48 | PE | Baidin, Misharev, et al., 1985 | LBLHLM |
8.70 | PE | Baidin, Misharev, et al., 1985 | Vertical value; LBLHLM |
8.82 | PE | Limouzin and Maire, 1975 | Vertical value; LLK |
Appearance energy determinations
Ion | AE (eV) | Other Products | Method | Reference | Comment |
---|---|---|---|---|---|
C9H10Cl+ | 9.5 ± 0.1 | CH3 | EI | Orlov, Misharev, et al., 1986 | LBLHLM |

References

Kovel, Nesterova, et al., 1982
Kovel, E.N.; Nesterova, T.N.; Rozhnov, A.M.,
Heats of formation of tert-butylchlorobenzenes, Deposited Document, SPSTL 385 Khp-D80. Chem. Abst. 97:23198n, 1982, 1-5. [all data]
Weast and Grasselli, 1989
CRC Handbook of Data on Organic Compounds, 2nd Editon, Weast,R.C and Grasselli, J.G., ed(s)., CRC Press, Inc., Boca Raton, FL, 1989, 1. [all data]
Benkeser, Crimmins, et al., 1968
Benkeser, R.A.; Crimmins, T.F.; Tong, W.H.,
Factors Governing Orientation in Metalation Reactions IV. The Role of Alkoxide in Metalation Reactions Involving Organosodium Compounds,
J. Am. Chem. Soc., 1968, 90, 4366-70. [all data]
Rueggeberg, Cushing, et al., 1946
Rueggeberg, W.H.; Cushing, M.L.; Cook, W.A.,
Condensation of ALiphatic Alcohols with Aryl Hydrocarbons in the Presence of Chlorosulfuric Acid,
J. Am. Chem. Soc., 1946, 68, 191. [all data]
Kovzel, Nesterova, et al., 1981
Kovzel, E.N.; Nesterova, T.N.; Rozhnov, A.M.; Kartavtseva, T.A.,
Study of equilibrium in in the chlorobenzene-butylchlorobenzenes systems,
Termodin. Organ. Soedin., 1981, 65-68. [all data]
Orlov, Misharev, et al., 1986
Orlov, V.; Misharev, A.; Takhistox, V.,
Determination of the enthalpy of formation of para-substituted α,α-dimethyl cations in the gas phase,
Izv. Akad. Nauk SSSR Ser. Khim., 1986, 9, 2006. [all data]
Baidin, Misharev, et al., 1985
Baidin, V.N.; Misharev, A.D.; Takhistov, V.V.,
Effect of alkyl substituents on the ionization potentials of halogenobenzenes,
Zh. Org. Khim., 1985, 21, 817. [all data]
Limouzin and Maire, 1975
Limouzin, Y.; Maire, J.C.,
Spectres photoelectroniques des composes organometalliques,
J. Organomet. Chem., 1975, 92, 169. [all data]