1,1'-Biphenyl,3,3'-difluoro-
- Formula: C12H8F2
- Molecular weight: 190.1887
- IUPAC Standard InChIKey: GAYJHUJLHJWCTH-UHFFFAOYSA-N
- CAS Registry Number: 396-64-5
- Chemical structure:
View 3d structure (requires JavaScript / HTML 5) - Other names: 3,3'-difluoro-1,1'-biphenyl

Phase change data

Data compiled by: Robert L. Brown and Stephen E. Stein
Reduced pressure boiling point
Tboil (K) | Pressure (bar) | Reference |
---|---|---|
403.2 | 0.019 | Weast and Grasselli, 1989 |

Gas phase ion energetics data

Data compiled as indicated in comments:
LLK - Sharon G. Lias, Rhoda D. Levin, and Sherif A. Kafafi
Ionization energy determinations
IE (eV) | Method | Reference | Comment |
---|---|---|---|
8.35 ± 0.02 | PE | Maier and Turner, 1972 | LLK |

References

Weast and Grasselli, 1989
CRC Handbook of Data on Organic Compounds, 2nd Editon, Weast,R.C and Grasselli, J.G., ed(s)., CRC Press, Inc., Boca Raton, FL, 1989, 1. [all data]
Maier and Turner, 1972
Maier, J.P.; Turner, D.W.,
Steric inhibition of resonance studied by molecular photoelectron spectroscopy. Part I. Biphenyls,
Faraday Discuss. Chem. Soc., 1972, 54, 149. [all data]