Sulfur chloride
- Formula: ClS2
- Molecular weight: 99.583
- IUPAC Standard InChIKey: ASGYIKBYZKQKJC-UHFFFAOYSA-N
- CAS Registry Number: 39594-91-7
- Chemical structure:
View 3d structure (requires JavaScript / HTML 5) - Permanent link for this species. Use this link for bookmarking this species for future reference.

Gas phase thermochemistry data

Quantity | Value | Units | Method | Reference | Comment |
---|---|---|---|---|---|
ΔfH°gas | 78.56 | kJ/mol | Review | Chase, 1998 | Data last reviewed in June, 1978 |
Quantity | Value | Units | Method | Reference | Comment |
S°gas,1 bar | 291.66 | J/mol*K | Review | Chase, 1998 | Data last reviewed in June, 1978 |
Gas Phase Heat Capacity (Shomate Equation)
Cp° = A + B*t + C*t2 + D*t3 +
E/t2
H° − H°298.15= A*t + B*t2/2 +
C*t3/3 + D*t4/4 − E/t + F − H
S° = A*ln(t) + B*t + C*t2/2 + D*t3/3 −
E/(2*t2) + G
Cp = heat capacity (J/mol*K)
H° = standard enthalpy (kJ/mol)
S° = standard entropy (J/mol*K)
t = temperature (K) / 1000.
View plot Requires a JavaScript / HTML 5 canvas capable browser.
Temperature (K) | 298. to 6000. |
---|---|
A | 57.20365 |
B | 0.993775 |
C | -0.353668 |
D | 0.045370 |
E | -0.591505 |
F | 59.47933 |
G | 357.2734 |
H | 78.55920 |
Reference | Chase, 1998 |
Comment | Data last reviewed in June, 1978 |

Vibrational and/or electronic energy levels

Data compiled by: Marilyn E. Jacox
State: B
Energy (cm-1) |
Med. | Transition | λmin (nm) |
λmax (nm) |
References | ||
---|---|---|---|---|---|---|---|
To = 21650 | gas | 378 | 481 | McGrath, 1960 | |||
Donovan, Husain, et al., 1968 | |||||||
Chiu, Pan, et al., 1986 | |||||||
To = 21925 | U | Ar | 389 | 456 | Wight and Andrews, 1978 | ||
Vib. sym. |
No. | Approximate type of mode |
cm-1 | Med. | Method | References | |
---|---|---|---|---|---|---|---|
a' | 1 | Stretch | 480 | gas | AB | Chiu, Pan, et al., 1986 | |
1 | Stretch | 491 ± 20 | Ar | AB | Wight and Andrews, 1978 | ||
3 | Stretch | 407 | gas | AB | Chiu, Pan, et al., 1986 | ||
State: A
Vib. sym. |
No. | Approximate type of mode |
cm-1 | Med. | Method | References | |
---|---|---|---|---|---|---|---|
a' | 1 | SS stretch | 630 | gas | LF | Chiu and Chang, 1994 Chang, 1995 | |
2 | Bend | 249 | gas | LF | Chiu and Chang, 1994 Chang, 1995 | ||
3 | SCl stretch | 554 | gas | LF | Chiu and Chang, 1994 Chang, 1995 | ||
State: X
Vib. sym. |
No. | Approximate type of mode |
cm-1 | Med. | Method | References | |
---|---|---|---|---|---|---|---|
a' | 1 | SS stretch | 662 ± 3 | gas | AB LF | Chiu, Pan, et al., 1986 Chiu and Chang, 1994 Chang, 1995 | |
1 | SS stretch | 665 | Ar | IR | Vahl and Feuerhahn, 1979 | ||
2 | Bend | 196 | gas | Ra LF | Chiu and Chang, 1994 Chang, 1995 | ||
3 | SCl stretch | 450 | gas | Ra LF | Chiu and Chang, 1994 Chang, 1995 | ||
3 | SCl stretch | 404 | Ar | IR | Vahl and Feuerhahn, 1979 | ||
Additional references: Jacox, 1994, page 111; Jacox, 1998, page 205; Fujitake and Hirota, 1994

References

Chase, 1998
Chase, M.W., Jr.,
NIST-JANAF Themochemical Tables, Fourth Edition,
J. Phys. Chem. Ref. Data, Monograph 9, 1998, 1-1951. [all data]
McGrath, 1960
McGrath, W.D.,
The Production of Vibrationally Excited S2 in the Isothermal Flash Photolysis of S2Cl2,
J. Chem. Phys., 1960, 33, 1, 297, https://doi.org/10.1063/1.1731104
. [all data]
Donovan, Husain, et al., 1968
Donovan, R.J.; Husain, D.; Jackson, P.T.,
Transient species in the photolysis of sulphur monochloride, including S2(a 1? g ).,
Trans. Faraday Soc., 1968, 64, 1798, https://doi.org/10.1039/tf9686401798
. [all data]
Chiu, Pan, et al., 1986
Chiu, C.L.; Pan, S.C.; Ni, C.K.,
Recognition of the violet system of S2Cl in the pyrolysis of S2Cl2,
J. Chem. Phys., 1986, 85, 1, 10, https://doi.org/10.1063/1.451648
. [all data]
Wight and Andrews, 1978
Wight, C.A.; Andrews, L.,
Matrix reactions of dichlorodisulfane with alkali metals,
J. Mol. Spectrosc., 1978, 72, 3, 342, https://doi.org/10.1016/0022-2852(78)90134-0
. [all data]
Chiu and Chang, 1994
Chiu, C.-L.; Chang, H.,
Spectrochim. Acta, 1994, 50A, 2239. [all data]
Chang, 1995
Chang, C.L. ChiuadnH.,
J. Chin. Chem. Soc. (Taipei), 1995, 42, 19. [all data]
Vahl and Feuerhahn, 1979
Vahl, G.; Feuerhahn, M.,
J. Chem. Res., 1979, Synop., 237. [all data]
Jacox, 1994
Jacox, M.E.,
Vibrational and electronic energy levels of polyatomic transient molecules, American Chemical Society, Washington, DC, 1994, 464. [all data]
Jacox, 1998
Jacox, M.E.,
Vibrational and electronic energy levels of polyatomic transient molecules: supplement A,
J. Phys. Chem. Ref. Data, 1998, 27, 2, 115-393, https://doi.org/10.1063/1.556017
. [all data]
Fujitake and Hirota, 1994
Fujitake, M.; Hirota, E.,
The microwave spectrum of the ClS,
Can. J. Phys., 1994, 72, 11-12, 1043, https://doi.org/10.1139/p94-136
. [all data]