Thiophene, tetrabromo-

Phase change data

Data compiled by: Robert L. Brown and Stephen E. Stein

Quantity Value Units Method Reference Comment
Tboil599.2KN/AWeast and Grasselli, 1989

Gas phase ion energetics data

Data compiled by: Sharon G. Lias, Rhoda D. Levin, and Sherif A. Kafafi

Ionization energy determinations

IE (eV) Method Reference Comment
8.53PEBozic, Humski, et al., 1977Vertical value

References

Weast and Grasselli, 1989
CRC Handbook of Data on Organic Compounds, 2nd Editon, Weast,R.C and Grasselli, J.G., ed(s)., CRC Press, Inc., Boca Raton, FL, 1989, 1. [all data]

Bozic, Humski, et al., 1977
Bozic, Z.; Humski, K.; Cvitas, T.; Klasinc, L., Photoelectron spectra of bromo- and iodo- thiophens, J. Chem. Soc. Perkin Trans. 2, 1977, 1413. [all data]