7,7'-bis(Cycloheptatrienyl)
- Formula: C14H14
- Molecular weight: 182.2610
- IUPAC Standard InChIKey: DMVKBMNNLFFZBY-UHFFFAOYSA-N
- CAS Registry Number: 39473-62-6
- Chemical structure:
View 3d structure (requires JavaScript / HTML 5) - Species with the same structure:
- Other names: Bicycloheptatrienyl

Gas phase ion energetics data

Data compiled as indicated in comments:
LLK - Sharon G. Lias, Rhoda D. Levin, and Sherif A. Kafafi
Ionization energy determinations
IE (eV) | Method | Reference | Comment |
---|---|---|---|
8.2 | PE | Koenig and Chang, 1978 | LLK |
8.62 | PE | Koenig and Chang, 1978 | Vertical value; LLK |

References

Koenig and Chang, 1978
Koenig, T.; Chang, J.C.,
Helium(I) photoelectron spectrum of tropyl radical,
J. Am. Chem. Soc., 1978, 100, 2240. [all data]