thiophosphoryl tribromide
- Formula: Br3PS
- Molecular weight: 302.751
- IUPAC Standard InChIKey: ZSCCOCBYYJPSBX-UHFFFAOYSA-N
- CAS Registry Number: 3931-89-3
- Chemical structure:
View 3d structure (requires JavaScript / HTML 5) - Other names: Thiophosphoryl bromide

Gas phase thermochemistry data

Quantity | Value | Units | Method | Reference | Comment |
---|---|---|---|---|---|
ΔfH°gas | -281.05 | kJ/mol | Review | Chase, 1998 | Data last reviewed in December, 1963 |
Quantity | Value | Units | Method | Reference | Comment |
S°gas,1 bar | 372.77 | J/mol*K | Review | Chase, 1998 | Data last reviewed in December, 1963 |
Gas Phase Heat Capacity (Shomate Equation)
Cp° = A + B*t + C*t2 + D*t3 +
E/t2
H° − H°298.15= A*t + B*t2/2 +
C*t3/3 + D*t4/4 − E/t + F − H
S° = A*ln(t) + B*t + C*t2/2 + D*t3/3 −
E/(2*t2) + G
Cp = heat capacity (J/mol*K)
H° = standard enthalpy (kJ/mol)
S° = standard entropy (J/mol*K)
t = temperature (K) / 1000.
View plot Requires a JavaScript / HTML 5 canvas capable browser.
Temperature (K) | 298. to 6000. |
---|---|
A | 106.3715 |
B | 1.453477 |
C | -0.392171 |
D | 0.033377 |
E | -1.076105 |
F | -316.4363 |
G | 495.0258 |
H | -281.0523 |
Reference | Chase, 1998 |
Comment | Data last reviewed in December, 1963 |

Gas phase ion energetics data

Data compiled by: Sharon G. Lias, Rhoda D. Levin, and Sherif A. Kafafi
Ionization energy determinations
IE (eV) | Method | Reference | Comment |
---|---|---|---|
9.82 | PE | Berkosky, Ellison, et al., 1973 | Vertical value |
9.89 ± 0.03 | PE | Cox, Evans, et al., 1972 | Vertical value |

References

Chase, 1998
Chase, M.W., Jr.,
NIST-JANAF Themochemical Tables, Fourth Edition,
J. Phys. Chem. Ref. Data, Monograph 9, 1998, 1-1951. [all data]
Berkosky, Ellison, et al., 1973
Berkosky, J.L.; Ellison, F.O.; Lee, T.H.; Rabalais, J.W.,
Model for calculating spin-orbit interactions with applications to photoelectron spectroscopy,
J. Chem. Phys., 1973, 59, 5342. [all data]
Cox, Evans, et al., 1972
Cox, P.A.; Evans, S.; Orchard, A.F.; Richardson, N.V.; Roberts, P.J.,
Simple quantitative molecular orbital methods used in connection with photoelectron spectroscopy,
Faraday Discuss. Chem. Soc., 1972, 54, 26. [all data]