1-(4-Aminophenyl)-2-bromoethane
- Formula: C8H10BrN
- Molecular weight: 200.076
- IUPAC Standard InChIKey: WNPSMKHXUKDOBN-UHFFFAOYSA-N
- CAS Registry Number: 39232-03-6
- Chemical structure:
View 3d structure (requires JavaScript / HTML 5) - Permanent link for this species. Use this link for bookmarking this species for future reference.

Gas phase ion energetics data

Data compiled by: Henry M. Rosenstock, Keith Draxl, Bruce W. Steiner, and John T. Herron
Ionization energy determinations
IE (eV) | Method | Reference |
---|---|---|
7.8 | EI | Grutzmacher, 1970 |
Appearance energy determinations
Ion | AE (eV) | Other Products | Method | Reference | Comment |
---|---|---|---|---|---|
C8H10N+ | 9.9 | Br | EI | Grutzmacher, 1970 |

References

Grutzmacher, 1970
Grutzmacher, H.-F.,
Zum Mechanismus massenspektrometrischer Fragmentierungsreaktionen-IV: zur Bildung von Phenonium-Ionen bei der Elektronenstoss-Fragmentierung von -Phenylathylbromiden,
Org. Mass Spectrom., 1970, 3, 131. [all data]