Ethanethioamide,N-(2-chlorophenyl)-
- Formula: C8H8ClNS
- Molecular weight: 185.674
- IUPAC Standard InChIKey: IITBJRJPHOLQNH-UHFFFAOYSA-N
- CAS Registry Number: 39184-83-3
- Chemical structure:
View 3d structure (requires JavaScript / HTML 5) - Permanent link for this species. Use this link for bookmarking this species for future reference.

Gas phase ion energetics data

Data compiled by: Sharon G. Lias, Rhoda D. Levin, and Sherif A. Kafafi
Ionization energy determinations
IE (eV) | Method | Reference |
---|---|---|
8.10 | EI | Baldwin, Loudon, et al., 1976 |
Appearance energy determinations
Ion | AE (eV) | Other Products | Method | Reference | Comment |
---|---|---|---|---|---|
C6H6NCl+ | 11.00 | ? | EI | Baldwin, Loudon, et al., 1976 | |
C8H8NS+ | 8.65 | Cl | EI | Baldwin, Loudon, et al., 1976 |

References

Baldwin, Loudon, et al., 1976
Baldwin, M.A.; Loudon, A.G.; Maccoll, A.; Webb, K.S.,
The nature and fragmentation pathways of the molecular ions of some arylureas, arylthioureas, acetanilides, thioacetanilides and related compounds,
Org. Mass Spectrom., 1976, 11, 1181. [all data]