Trimethylsilyl methyl sulfide
- Formula: C4H12SSi
- Molecular weight: 120.289
- IUPAC Standard InChIKey: JDYCDPFQWXHUDL-UHFFFAOYSA-N
- CAS Registry Number: 3908-55-2
- Chemical structure:
View 3d structure (requires JavaScript / HTML 5) - Other names: (CH3)3SiSCH3; Methylthiotrimethylsilane; Silane, trimethyl(methylthio)-; trimethyl(methylthio)silane

Gas phase ion energetics data

Data compiled as indicated in comments:
LLK - Sharon G. Lias, Rhoda D. Levin, and Sherif A. Kafafi
Ionization energy determinations
IE (eV) | Method | Reference | Comment |
---|---|---|---|
8.4 | PE | Distefano, Ricci, et al., 1974 | LLK |
8.69 ± 0.05 | PE | Distefano, Ricci, et al., 1974 | Vertical value; LLK |

Normal alkane RI, non-polar column, temperature ramp

Column type | Active phase | I | Reference | Comment |
---|---|---|---|---|
Capillary | OV-101 | 745. | Zenkevich, 2005 | 25. m/0.20 mm/0.10 μm, N2/He, 6. K/min; Tstart: 50. C; Tend: 250. C |

References

Distefano, Ricci, et al., 1974
Distefano, G.; Ricci, A.; Colonna, F.P.; Pietropaolo, D.; Pignataro, S.,
Bonding between sulfur and the elements of Group IV studied by UV photoelectron spectroscopy,
J. Organomet. Chem., 1974, 78, 93. [all data]
Zenkevich, 2005
Zenkevich, I.G.,
Experimentally measured retention indices., 2005. [all data]