Iron,dicarbonyl(η5-2,4-cyclopentadien-1-yl)-2-propenyl-

Gas phase ion energetics data

Data compiled by: Sharon G. Lias, Rhoda D. Levin, and Sherif A. Kafafi

Ionization energy determinations

IE (eV) Method Reference Comment
7.97PEFabian, Fehlner, et al., 1980Vertical value

References

Fabian, Fehlner, et al., 1980
Fabian, B.D.; Fehlner, T.P.; Hwang, L.-S.J.; Labinger, J.A., Allylic interactions in organometallics: Probing electronic structure in (η5-C5H5)Fe(CO)2R, R=CH31-C3H5, η1-C5H5, J. Organomet. Chem., 1980, 191, 409. [all data]