Benzene, pentafluoromethoxy-
- Formula: C7H3F5O
- Molecular weight: 198.0901
- IUPAC Standard InChIKey: ZRQUIRABLIQJRI-UHFFFAOYSA-N
- CAS Registry Number: 389-40-2
- Chemical structure:
View 3d structure (requires JavaScript / HTML 5) - Other names: Pentafluoroanisole; 2,3,4,5,6-Pentafluoroanisole; Anisole, 2,3,4,5,6-pentafluoro-; Methyl pentafluorophenyl ether; Pentafluorophenyl methyl ether

Phase change data

Data compiled by: Robert L. Brown and Stephen E. Stein
Quantity | Value | Units | Method | Reference | Comment |
---|---|---|---|---|---|
Tboil | 411. | K | N/A | PCR Inc., 1990 | |
Tboil | 411.7 | K | N/A | Weast and Grasselli, 1989 |

Reaction thermochemistry data

Data compiled by: Michael M. Meot-Ner (Mautner) and Sharon G. Lias
Individual Reactions
By formula: F- + C7H3F5O = (F- • C7H3F5O)
Quantity | Value | Units | Method | Reference | Comment |
---|---|---|---|---|---|
ΔrH° | 157. | kJ/mol | PHPMS | Dillow and Kebarle, 1988 | gas phase; switching reaction,Thermochemical ladder(F-)C6F6, Entropy change calculated or estimated; Hiraoka, Mizuse, et al., 1987 |
Quantity | Value | Units | Method | Reference | Comment |
ΔrS° | 84.1 | J/mol*K | N/A | Dillow and Kebarle, 1988 | gas phase; switching reaction,Thermochemical ladder(F-)C6F6, Entropy change calculated or estimated; Hiraoka, Mizuse, et al., 1987 |
Free energy of reaction
ΔrG° (kJ/mol) | T (K) | Method | Reference | Comment |
---|---|---|---|---|
121. | 423. | PHPMS | Dillow and Kebarle, 1988 | gas phase; switching reaction,Thermochemical ladder(F-)C6F6, Entropy change calculated or estimated; Hiraoka, Mizuse, et al., 1987 |

Gas phase ion energetics data

Data compiled as indicated in comments:
LLK - Sharon G. Lias, Rhoda D. Levin, and Sherif A. Kafafi
B - John E. Bartmess
Electron affinity determinations
EA (eV) | Method | Reference | Comment |
---|---|---|---|
0.542 ± 0.087 | ECD | Hernandez-Gill, Wentworth, et al., 1984 | B |
Ionization energy determinations
IE (eV) | Method | Reference | Comment |
---|---|---|---|
9.10 ± 0.02 | PE | Maier and Turner, 1973 | LLK |

Ion clustering data

Data compiled by: Michael M. Meot-Ner (Mautner) and Sharon G. Lias
Clustering reactions
By formula: F- + C7H3F5O = (F- • C7H3F5O)
Quantity | Value | Units | Method | Reference | Comment |
---|---|---|---|---|---|
ΔrH° | 157. | kJ/mol | PHPMS | Dillow and Kebarle, 1988 | gas phase; switching reaction,Thermochemical ladder(F-)C6F6, Entropy change calculated or estimated; Hiraoka, Mizuse, et al., 1987 |
Quantity | Value | Units | Method | Reference | Comment |
ΔrS° | 84.1 | J/mol*K | N/A | Dillow and Kebarle, 1988 | gas phase; switching reaction,Thermochemical ladder(F-)C6F6, Entropy change calculated or estimated; Hiraoka, Mizuse, et al., 1987 |
Free energy of reaction
ΔrG° (kJ/mol) | T (K) | Method | Reference | Comment |
---|---|---|---|---|
121. | 423. | PHPMS | Dillow and Kebarle, 1988 | gas phase; switching reaction,Thermochemical ladder(F-)C6F6, Entropy change calculated or estimated; Hiraoka, Mizuse, et al., 1987 |

References

PCR Inc., 1990
PCR Inc.,
Research Chemicals Catalog 1990-1991, PCR Inc., Gainesville, FL, 1990, 1. [all data]
Weast and Grasselli, 1989
CRC Handbook of Data on Organic Compounds, 2nd Editon, Weast,R.C and Grasselli, J.G., ed(s)., CRC Press, Inc., Boca Raton, FL, 1989, 1. [all data]
Dillow and Kebarle, 1988
Dillow, G.W.; Kebarle, P.,
Fluoride Affinities of Perfluorobenzenes C6F5X. Meisenheimer Complexes in the Gas Phase and Solution,
J. Am. Chem. Soc., 1988, 110, 15, 4877, https://doi.org/10.1021/ja00223a001
. [all data]
Hiraoka, Mizuse, et al., 1987
Hiraoka, K.; Mizuse, S.; Yamabe, S.,
A Determination of the Stability and Structure of F-(C6H6) and F-(C6F6) Clusters,
J. Chem. Phys., 1987, 86, 7, 4102, https://doi.org/10.1063/1.451920
. [all data]
Hernandez-Gill, Wentworth, et al., 1984
Hernandez-Gill, N.; Wentworth, W.E.; Chen, E.C.M.,
Electron affinities of fluorinated phenoxy radicals,
J. Phys. Chem., 1984, 88, 6181. [all data]
Maier and Turner, 1973
Maier, J.P.; Turner, D.W.,
Steric inhibition of resonance studied by molecular photoelectron spectroscopy Part 3. Anilines, Phenols and Related Compounds,
J. Chem. Soc. Faraday Trans. 2, 1973, 69, 521. [all data]
Forbes, Richardson, et al., 1959
Forbes, E.J.; Richardson, R.D.; Stacey, M.; Tatlow, J.C.,
Aromatic polyfluoro-compounds. Part II. Pentafluorophenol,
J. Chem. Soc., 1959, 2019-2021. [all data]