Tetracyclo[3.2.0.02,7.04,6]heptane,3-methylene-
- Formula: C8H8
- Molecular weight: 104.1491
- IUPAC Standard InChIKey: IZMSINAXDCVVQY-UHFFFAOYSA-N
- CAS Registry Number: 38898-42-9
- Chemical structure:
View 3d structure (requires JavaScript / HTML 5) - Permanent link for this species. Use this link for bookmarking this species for future reference.

Gas phase ion energetics data

Data compiled by: Sharon G. Lias, Rhoda D. Levin, and Sherif A. Kafafi
Ionization energy determinations
IE (eV) | Method | Reference | Comment |
---|---|---|---|
8.48 | PE | Martin, Heller, et al., 1974 | Vertical value |

References

Martin, Heller, et al., 1974
Martin, H.-D.; Heller, C.; Haselbach, E.; Lanyjova, Z.,
49. Quadricyclanes. Part I: Photoelectron spectra and electronic structure,
Helv. Chim. Acta, 1974, 57, 465. [all data]