Bicyclo[4.2.1]nona-2,4,7-triene,9-methylene-
- Formula: C10H10
- Molecular weight: 130.1864
- IUPAC Standard InChIKey: HKYOBSQBRZMONP-UHFFFAOYSA-N
- CAS Registry Number: 38898-39-4
- Chemical structure:
View 3d structure (requires JavaScript / HTML 5) - Permanent link for this species. Use this link for bookmarking this species for future reference.

Gas phase ion energetics data

Data compiled by: Sharon G. Lias, Rhoda D. Levin, and Sherif A. Kafafi
Ionization energy determinations
IE (eV) | Method | Reference | Comment |
---|---|---|---|
8.25 | PE | Reetz, Hoffmann, et al., 1973 | Vertical value |

References

Reetz, Hoffmann, et al., 1973
Reetz, M.T.; Hoffmann, R.W.; Schafer, W.; Schweig, A.,
Methylenebicyclo [4.2.1]nona-2,4,7-triene,
Angew. Chem. Int. Ed. Engl., 1973, 12, 81. [all data]