Chloromethylidyne
- Formula: CCl
- Molecular weight: 47.464
- IUPAC Standard InChIKey: BBFYMZCRBPASGM-UHFFFAOYSA-N
- CAS Registry Number: 3889-76-7
- Chemical structure:
View 3d structure (requires JavaScript / HTML 5) - Permanent link for this species. Use this link for bookmarking this species for future reference.

Gas phase thermochemistry data

Quantity | Value | Units | Method | Reference | Comment |
---|---|---|---|---|---|
ΔfH°gas | 502.08 | kJ/mol | Review | Chase, 1998 | Data last reviewed in December, 1969 |
Quantity | Value | Units | Method | Reference | Comment |
S°gas,1 bar | 224.52 | J/mol*K | Review | Chase, 1998 | Data last reviewed in December, 1969 |
Gas Phase Heat Capacity (Shomate Equation)
Cp° = A + B*t + C*t2 + D*t3 +
E/t2
H° − H°298.15= A*t + B*t2/2 +
C*t3/3 + D*t4/4 − E/t + F − H
S° = A*ln(t) + B*t + C*t2/2 + D*t3/3 −
E/(2*t2) + G
Cp = heat capacity (J/mol*K)
H° = standard enthalpy (kJ/mol)
S° = standard entropy (J/mol*K)
t = temperature (K) / 1000.
View plot Requires a JavaScript / HTML 5 canvas capable browser.
Temperature (K) | 298. to 600. | 600. to 6000. |
---|---|---|
A | 18.71047 | 37.27739 |
B | 59.00444 | 0.444809 |
C | -73.98693 | -0.033748 |
D | 34.79908 | 0.012986 |
E | 0.142772 | -0.793207 |
F | 494.9421 | 488.5824 |
G | 233.3505 | 265.8560 |
H | 502.0800 | 502.0800 |
Reference | Chase, 1998 | Chase, 1998 |
Comment | Data last reviewed in December, 1969 | Data last reviewed in December, 1969 |

Gas phase ion energetics data

Data compiled as indicated in comments:
LBLHLM - Sharon G. Lias, John E. Bartmess, Joel F. Liebman, John L. Holmes, Rhoda D. Levin, and W. Gary Mallard
RDSH - Henry M. Rosenstock, Keith Draxl, Bruce W. Steiner, and John T. Herron
Ionization energy determinations
IE (eV) | Method | Reference | Comment |
---|---|---|---|
8.9 ± 0.2 | PE | Hepburn, Trevor, et al., 1982 | LBLHLM |
12.9 ± 0.10 | EI | Reed and Snedden, 1958 | RDSH |

Constants of diatomic molecules

Data compiled by: Klaus P. Huber and Gerhard H. Herzberg
Data collected through July, 1976
Symbol | Meaning |
---|---|
State | electronic state and / or symmetry symbol |
Te | minimum electronic energy (cm-1) |
ωe | vibrational constant – first term (cm-1) |
ωexe | vibrational constant – second term (cm-1) |
ωeye | vibrational constant – third term (cm-1) |
Be | rotational constant in equilibrium position (cm-1) |
αe | rotational constant – first term (cm-1) |
γe | rotation-vibration interaction constant (cm-1) |
De | centrifugal distortion constant (cm-1) |
βe | rotational constant – first term, centrifugal force (cm-1) |
re | internuclear distance (Å) |
Trans. | observed transition(s) corresponding to electronic state |
ν00 | position of 0-0 band (units noted in table) |
State | Te | ωe | ωexe | ωeye | Be | αe | γe | De | βe | re | Trans. | ν00 |
---|---|---|---|---|---|---|---|---|---|---|---|---|
A 2Δr | 1 | [848.1] H | [0.70620] | [1.84E-4] | [1.6346] | A ↔ X V | 35870.28 2 Z | |||||
↳Gordon and King, 1961; Simons and Yarwood, 1961; missing citation; Ovcharenko, Kuzyakov, et al., 1965 | ||||||||||||
A ↔ X V | 36003.92 2 Z | |||||||||||
↳Gordon and King, 1961; Simons and Yarwood, 1961; missing citation; Ovcharenko, Kuzyakov, et al., 1965 | ||||||||||||
X 2Π3/2 | 3 | [865.48] Z | 0.70099 | 0.00678 | 1.89E-4 4 | 1.645 5 | ||||||
X 2Π1/2 | 0 | [866.72] Z | 6.2 H | 0.6936 6 | 0.00672 | 1.9E-4 7 | 1.645 |

References

Chase, 1998
Chase, M.W., Jr.,
NIST-JANAF Themochemical Tables, Fourth Edition,
J. Phys. Chem. Ref. Data, Monograph 9, 1998, 1-1951. [all data]
Hepburn, Trevor, et al., 1982
Hepburn, J.W.; Trevor, D.J.; Pollard, J.E.; Shirley, D.A.; Lee, Y.T.,
Multiphoton ionization photoelectron spectroscopy of CCl2F2 and CCl3F,
J. Chem. Phys., 1982, 76, 4287. [all data]
Reed and Snedden, 1958
Reed, R.I.; Snedden, W.,
Studies in electron impact methods. Part 2. The latent heat of sublimation of carbon,
J. Chem. Soc. Faraday Trans., 1958, 54, 301. [all data]
Gordon and King, 1961
Gordon, R.D.; King, G.W.,
The emission spectrum of the CCl radical,
Can. J. Phys., 1961, 39, 252. [all data]
Simons and Yarwood, 1961
Simons, J.P.; Yarwood, A.J.,
Decomposition of hot radicals. Part 1. The production of CCl and CBr from halogen-substituted methyl radicals,
Trans. Faraday Soc., 1961, 57, 2167. [all data]
Ovcharenko, Kuzyakov, et al., 1965
Ovcharenko, I.E.; Kuzyakov, Y.Y.; Tatevskii, V.M.,
Concerning the vibrational constants and dissociation energy of the CCl molecule,
Opt. Spectrosc. Engl. Transl., 1965, 19, 294-295, In original 528-530. [all data]
Merer, Travis, et al., 1966
Merer, A.J.; Travis, D.N.; Watson, J.K.G.,
Spin-orbit coupling in the A2Δ state of CCl,
Can. J. Phys., 1966, 44, 447. [all data]
Bialski and Grein, 1976
Bialski, M.; Grein, F.,
Theoretical studies on low-lying valence states of NS, SiF, and CCl,
J. Mol. Spectrosc., 1976, 61, 321. [all data]
Miller and Palmer, 1964
Miller, W.J.; Palmer, H.B.,
Chemiluminescence and radical reactions in diffusion flames of alkali metals with organic halides,
J. Chem. Phys., 1964, 40, 3701. [all data]