Pyridinium,3-amino-1-methyl-,hydroxide,inner salt
- Formula: C6H8N2
- Molecular weight: 108.1411
- IUPAC Standard InChIKey: NYAFDISYTYRTQA-UHFFFAOYSA-N
- CAS Registry Number: 38879-42-4
- Chemical structure:
View 3d structure (requires JavaScript / HTML 5) - Permanent link for this species. Use this link for bookmarking this species for future reference.

Gas phase ion energetics data

Data compiled by: Sharon G. Lias, Rhoda D. Levin, and Sherif A. Kafafi
Ionization energy determinations
IE (eV) | Method | Reference |
---|---|---|
7.5 ± 0.1 | EI | Gronneberg and Undheim, 1973 |

References

Gronneberg and Undheim, 1973
Gronneberg, T.; Undheim, K.,
Mass spectrometry of onium compounds - XV. ionization potentials of amino pyridines,
Tetrahedron Lett., 1973, 3193. [all data]