1,3,4-Oxadiazolidine,3,4-bis(1,1-dimethylethyl)-
- Formula: C10H22N2O
- Molecular weight: 186.2945
- IUPAC Standard InChIKey: OYCOANPMWDMWAN-UHFFFAOYSA-N
- CAS Registry Number: 38786-33-3
- Chemical structure:
View 3d structure (requires JavaScript / HTML 5) - Permanent link for this species. Use this link for bookmarking this species for future reference.

Gas phase ion energetics data

Data compiled by: Sharon G. Lias, Rhoda D. Levin, and Sherif A. Kafafi
Ionization energy determinations
IE (eV) | Method | Reference | Comment |
---|---|---|---|
8.15 | PE | Nelsen and Buschek, 1973 | Vertical value |

References

Nelsen and Buschek, 1973
Nelsen, S.F.; Buschek, J.M.,
Photoelectron spectra of hydrazines. I. Dependence of the lone pair-lone pair splitting on dihedral angle for tetraalkylhydrazines,
J. Am. Chem. Soc., 1973, 95, 2011. [all data]