Carbonic acid, ethyl phenyl ester
- Formula: C9H10O3
- Molecular weight: 166.1739
- IUPAC Standard InChIKey: YCNSGSUGQPDYTK-UHFFFAOYSA-N
- CAS Registry Number: 3878-46-4
- Chemical structure:
View 3d structure (requires JavaScript / HTML 5) - Other names: Ethyl phenyl carbonate; Phenyl ethyl carbonate

Gas phase ion energetics data

Data compiled by: Henry M. Rosenstock, Keith Draxl, Bruce W. Steiner, and John T. Herron
Appearance energy determinations
Ion | AE (eV) | Other Products | Method | Reference | Comment |
---|---|---|---|---|---|
C8H10O+ | 10.0 | CO2 | EI | Williams, Cooks, et al., 1968 |

Van Den Dool and Kratz RI, non-polar column, temperature ramp

Column type | Active phase | I | Reference | Comment |
---|---|---|---|---|
Capillary | 5 % Phenyl methyl siloxane | 1233. | Zaikin, 2009 | 30. m/0.25 mm/0.25 μm, 15. K/min, 270. C @ 15. min; Tstart: 60. C |

References

Williams, Cooks, et al., 1968
Williams, D.H.; Cooks, R.G.; Howe, I.,
Studies in mass spectrometry. XXXI. A comparison of reaction rates in common ions generated via fragmentation and direct ionization,
J. Am. Chem. Soc., 1968, 90, 6759. [all data]
Zaikin, 2009
Zaikin, V.G.,
Personal Communication: Retention indices measured during the period 2008 to 2009, 2009. [all data]