Propane, 1-(methylthio)-
- Formula: C4H10S
- Molecular weight: 90.187
- IUPAC Standard InChIKey: ZOASGOXWEHUTKZ-UHFFFAOYSA-N
- CAS Registry Number: 3877-15-4
- Chemical structure:
View 3d structure (requires JavaScript / HTML 5) - Other names: Sulfide, methyl propyl; Methyl propyl sulfide; 2-Thiapentane; 1-(Methylthio)propane; Methyl propyl sulphide; n-C3H7SCH3

Condensed phase thermochemistry data

Data compiled by: Eugene S. Domalski and Elizabeth D. Hearing
Quantity | Value | Units | Method | Reference | Comment |
---|---|---|---|---|---|
S°liquid | 272.55 | J/mol*K | N/A | Scott, Finke, et al., 1957 |
Constant pressure heat capacity of liquid
Cp,liquid (J/mol*K) | Temperature (K) | Reference | Comment |
---|---|---|---|
171.63 | 298.15 | Scott, Finke, et al., 1957 | T = 12 to 326 K. |

Phase change data

Data compiled as indicated in comments:
BS - Robert L. Brown and Stephen E. Stein
TRC - Thermodynamics Research Center, NIST Boulder Laboratories, Chris Muzny director
AC - William E. Acree, Jr., James S. Chickos
ALS - Hussein Y. Afeefy, Joel F. Liebman, and Stephen E. Stein
DH - Eugene S. Domalski and Elizabeth D. Hearing
Quantity | Value | Units | Method | Reference | Comment |
---|---|---|---|---|---|
Tboil | 368.7 | K | N/A | Weast and Grasselli, 1989 | BS |
Tboil | 368.7 | K | N/A | Majer and Svoboda, 1985 | |
Tboil | 368.8 | K | N/A | Haines, Helm, et al., 1956 | Uncertainty assigned by TRC = 0.3 K; TRC |
Tboil | 368.8 | K | N/A | Mcallan, Cullum, et al., 1951 | Uncertainty assigned by TRC = 0.3 K; TRC |
Tboil | 367. | K | N/A | Ingold, Jessop, et al., 1933 | Uncertainty assigned by TRC = 3. K; TRC |
Quantity | Value | Units | Method | Reference | Comment |
Tfus | 160.18 | K | N/A | Haines, Helm, et al., 1956 | Uncertainty assigned by TRC = 0.06 K; TRC |
Tfus | 160.17 | K | N/A | Mcallan, Cullum, et al., 1951 | Uncertainty assigned by TRC = 0.1 K; TRC |
Quantity | Value | Units | Method | Reference | Comment |
Ttriple | 160.17 | K | N/A | Scott, Finke, et al., 1957, 2 | Uncertainty assigned by TRC = 0.05 K; TRC |
Quantity | Value | Units | Method | Reference | Comment |
Tc | 574.1 | K | N/A | Majer and Svoboda, 1985 | |
Quantity | Value | Units | Method | Reference | Comment |
ΔvapH° | 36.31 | kJ/mol | N/A | Majer and Svoboda, 1985 | |
ΔvapH° | 36.2 | kJ/mol | N/A | Reid, 1972 | AC |
ΔvapH° | 36.3 ± 0.4 | kJ/mol | V | Scott, Finke, et al., 1957, 3 | Hfusion=2.50kcal/mol, see Hubbard, Good, et al., 1958; ALS |
Enthalpy of vaporization
ΔvapH (kJ/mol) | Temperature (K) | Method | Reference | Comment |
---|---|---|---|---|
32.08 | 368.7 | N/A | Majer and Svoboda, 1985 | |
35.3 | 323. | A,EB | Stephenson and Malanowski, 1987 | Based on data from 308. to 374. K. See also White, Barnard--Smith, et al., 1952.; AC |
34.5 ± 0.1 | 328. | C | Scott, Finke, et al., 1957 | AC |
33.4 ± 0.1 | 347. | C | Scott, Finke, et al., 1957 | AC |
32.1 ± 0.1 | 369. | C | Scott, Finke, et al., 1957 | AC |
Enthalpy of vaporization
ΔvapH =
A exp(-βTr) (1 − Tr)β
ΔvapH =
Enthalpy of vaporization (at saturation pressure)
(kJ/mol)
Tr = reduced temperature (T / Tc)
View plot Requires a JavaScript / HTML 5 canvas capable browser.
Temperature (K) | A (kJ/mol) | β | Tc (K) | Reference | Comment |
---|---|---|---|---|---|
328. to 369. | 52.19 | 0.2914 | 574.1 | Majer and Svoboda, 1985 |
Enthalpy of fusion
ΔfusH (kJ/mol) | Temperature (K) | Reference | Comment |
---|---|---|---|
9.912 | 160.17 | Scott, Finke, et al., 1957 | DH |
9.91 | 160.2 | Domalski and Hearing, 1996 | AC |
Entropy of fusion
ΔfusS (J/mol*K) | Temperature (K) | Reference | Comment |
---|---|---|---|
61.88 | 160.17 | Scott, Finke, et al., 1957 | DH |

Gas phase ion energetics data

Data compiled by: Henry M. Rosenstock, Keith Draxl, Bruce W. Steiner, and John T. Herron
Ionization energy determinations
IE (eV) | Method | Reference |
---|---|---|
8.8 ± 0.15 | EI | Hobrock and Kiser, 1962 |
Appearance energy determinations
Ion | AE (eV) | Other Products | Method | Reference | Comment |
---|---|---|---|---|---|
CHS+ | 15.2 ± 0.4 | ? | EI | Hobrock and Kiser, 1962 | |
CH2S+ | 14.1 ± 0.3 | ? | EI | Hobrock and Kiser, 1962 | |
CH3+ | 16.6 ± 0.5 | ? | EI | Hobrock and Kiser, 1962 | |
CH3S+ | 14.0 ± 0.2 | ? | EI | Hobrock and Kiser, 1962 | |
CH4S+ | 10.5 ± 0.1 | ? | EI | Keyes and Harrson, 1968 | |
CH5S+ | 10.2 ± 0.1 | ? | EI | Keyes and Harrson, 1968 | |
C2H3+ | 15.8 ± 0.4 | ? | EI | Hobrock and Kiser, 1962 | |
C2H5+ | 15.3 ± 0.5 | ? | EI | Hobrock and Kiser, 1962 | |
C2H5S+ | 11.0 ± 0.1 | C2H5 | EI | Keyes and Harrson, 1968 | |
C3H3+ | 18.4 ± 0.5 | ? | EI | Hobrock and Kiser, 1962 | |
C3H5+ | 14.8 ± 0.2 | ? | EI | Hobrock and Kiser, 1962 | |
C3H6+ | 12.5 ± 0.4 | ? | EI | Hobrock and Kiser, 1962 | |
C3H7+ | 12.3 ± 0.4 | ? | EI | Hobrock and Kiser, 1962 | |
C3H7S+ | 11.7 ± 0.2 | CH3 | EI | Hobrock and Kiser, 1962 |

Kovats' RI, non-polar column, isothermal

Column type | Active phase | Temperature (C) | I | Reference | Comment |
---|---|---|---|---|---|
Packed | Apiezon M | 130. | 715. | Garbuzov, Misharina, et al., 1985 | He or N2, Chromosorb W, AW-DMCS; Column length: 2.1 m |
Packed | Apiezon M | 60. | 706. | Mikhailova, Gren, et al., 1985 | Chromosorb WAW; Column length: 2.1 m |
Packed | Apiezon M | 130. | 715. | Golovnya, Garbuzov, et al., 1976 | N2, Chromosorb W; Column length: 2.1 m |
Packed | Apiezon M | 130. | 715. | Golovnya and Garbuzov, 1974 | N2, Chromosorb W; Column length: 2.1 m |
Packed | Apiezon L | 110. | 718. | Martinu and Janák, 1970 | |
Packed | Apiezon L | 130. | 723. | Martinu and Janák, 1970 | |
Packed | Apiezon L | 150. | 727. | Martinu and Janák, 1970 |

Kovats' RI, polar column, isothermal

Column type | Active phase | Temperature (C) | I | Reference | Comment |
---|---|---|---|---|---|
Packed | Polyethylene Glycol | 130. | 951. | Golovnya, Garbuzov, et al., 1976 | N2, Chromosorb W; Column length: 2.1 m |

Normal alkane RI, non-polar column, temperature ramp

Column type | Active phase | I | Reference | Comment |
---|---|---|---|---|
Capillary | HP-5 MS | 752. | Kim and Chung, 2009 | 30. m/0.25 mm/0.25 μm, Helium, 35. C @ 5. min, 2. K/min, 195. C @ 30. min |
Capillary | DB-5 | 715. | Meynier, Novelli, et al., 1999 | 30. m/0.32 mm/1. μm, 40. C @ 5. min, 3. K/min; Tend: 200. C |

Normal alkane RI, non-polar column, custom temperature program

Column type | Active phase | I | Reference | Comment |
---|---|---|---|---|
Capillary | HP-5 | 712. | Rotsatschakul, Visesanguan, et al., 2009 | 60. m/0.25 mm/0.25 μm, Helium; Program: 30 0C (2 min) 2 0Cmin -> 60 0C 10 0C/min -> 100 0C 20 0C/min -> 140 0C 10 0C/min -> 200 0C (10 min) |
Capillary | SPB-5 | 707. | Begnaud, Pérès, et al., 2003 | 60. m/0.32 mm/1. μm; Program: not specified |
Capillary | Polydimethyl siloxane | 714. | Spanier, Shahidi, et al., 2001 | Program: not specified |
Capillary | Polydimethyl siloxanes | 705. | Zenkevich, 1998 | Program: not specified |
Capillary | methyl silicone oil with 5% Igepal | 701. | Schultz, Flath, et al., 1988 | Column length: 150. m; Column diameter: 0.75 mm; Program: not specified |
Capillary | methyl silicone oil with 5% Igepal | 702. | Schultz, Flath, et al., 1988 | Column length: 150. m; Column diameter: 0.75 mm; Program: not specified |
Capillary | SE-52 | 717. | van Langenhove and Schamp, 1986 | Column length: 100. m; Column diameter: 0.50 mm; Program: not specified |

References

Scott, Finke, et al., 1957
Scott, D.W.; Finke, H.L.; McCullough, J.P.; Messerly, J.F.; Pennington, R.E.; Hossenlopp, I.A.; Waddington, G.,
1-Butanethiol and 2-thiapentane. Experimental thermodynamic studies between 12 and 500'K., thermodynamic functions by a refined method of increments,
J. Am. Chem. Soc., 1957, 79, 1062-1068. [all data]
Weast and Grasselli, 1989
CRC Handbook of Data on Organic Compounds, 2nd Editon, Weast,R.C and Grasselli, J.G., ed(s)., CRC Press, Inc., Boca Raton, FL, 1989, 1. [all data]
Majer and Svoboda, 1985
Majer, V.; Svoboda, V.,
Enthalpies of Vaporization of Organic Compounds: A Critical Review and Data Compilation, Blackwell Scientific Publications, Oxford, 1985, 300. [all data]
Haines, Helm, et al., 1956
Haines, W.E.; Helm, R.V.; Cook, G.L.; Ball, J.S.,
Purification and Properties of Organic Sulfur Compounds,
J. Phys. Chem., 1956, 60, 549-55. [all data]
Mcallan, Cullum, et al., 1951
Mcallan, D.T.; Cullum, T.V.; Dean, R.A.; Fidler, F.A.,
The Preparation and Properties of Sulfur Compounds Related to Petroleum I. The Dialkyl Sulfides and Disulfides,
J. Am. Chem. Soc., 1951, 73, 3627-32. [all data]
Ingold, Jessop, et al., 1933
Ingold; Jessop; Kuriyam; Mandour,
Influence of Poles and Polar Linkages on the Course Pursued by Elimination Reactions XVIII. Thermal Decompostion of Sulphoniumm Hydroxides,
J. Chem. Soc., 1933, 1933, 3455. [all data]
Scott, Finke, et al., 1957, 2
Scott, D.W.; Finke, H.L.; McCullough, J.P.; Messerly, J.F.; Pennington, R.E.; Hossenlopp, I.A.; Waddington, G.,
1-butanethiol and 2-thiapentane. Experimental thermodynamic studies between 12 and 500 K; thermodynamic functions by a refined method of increments.,
J. Am. Chem. Soc., 1957, 79, 1062-8. [all data]
Reid, 1972
Reid, Robert C.,
Handbook on vapor pressure and heats of vaporization of hydrocarbons and related compounds, R. C. Wilhort and B. J. Zwolinski, Texas A Research Foundation. College Station, Texas(1971). 329 pages.$10.00,
AIChE J., 1972, 18, 6, 1278-1278, https://doi.org/10.1002/aic.690180637
. [all data]
Scott, Finke, et al., 1957, 3
Scott, D.W.; Finke, H.L.; McCullough, J.P.; Messerly, J.F.; Pennington, R.E.; Hossenlopp, I.A.; Waddington, G.,
1-Butanethiol and 2-thiapentane. Experimental thermodynamic studies between 12 and 500°K; thermodynamic functions by a refined method of increments,
J. Am. Chem. Soc., 1957, 79, 1062-10. [all data]
Hubbard, Good, et al., 1958
Hubbard, W.N.; Good, W.D.; Waddington, G.,
The heats of combustion, formation and isomerization of the seven isomeric C4H10S alkane thiols and sulfides,
J. Phys. Chem., 1958, 62, 614-617. [all data]
Stephenson and Malanowski, 1987
Stephenson, Richard M.; Malanowski, Stanislaw,
Handbook of the Thermodynamics of Organic Compounds, 1987, https://doi.org/10.1007/978-94-009-3173-2
. [all data]
White, Barnard--Smith, et al., 1952
White, P.T.; Barnard--Smith, D.G.; Fidler, F.A.,
Vapor Pressure--Temperature Relationships of Sulfur Compounds Related to Petroleum,
Ind. Eng. Chem., 1952, 44, 6, 1430-1438, https://doi.org/10.1021/ie50510a064
. [all data]
Domalski and Hearing, 1996
Domalski, Eugene S.; Hearing, Elizabeth D.,
Heat Capacities and Entropies of Organic Compounds in the Condensed Phase. Volume III,
J. Phys. Chem. Ref. Data, 1996, 25, 1, 1, https://doi.org/10.1063/1.555985
. [all data]
Hobrock and Kiser, 1962
Hobrock, B.G.; Kiser, R.W.,
Electron impact spectroscopy of sulfur compounds. I. 2-Thiabutane, 2-thiapentane, and 2,3-dithiabutane,
J. Phys. Chem., 1962, 66, 1648. [all data]
Keyes and Harrson, 1968
Keyes, B.G.; Harrson, A.G.,
The fragmentation of aliphatic sulfur compounds by electron impact,
J. Am. Chem. Soc., 1968, 90, 5671. [all data]